{"text_format":"1","workbook":"xlsx","n_sheets":10,"sheets":["Table 1 SA4","Table 2 LGA","Graph NSW SA4 24 months","Graph LGA 24 months","Graph NSW SA4 60 months","Graph LGA 60 months","Working SA4","Working LGA","Module1","KendallMod"],"not_rendered":{"charts":4,"images":2,"macros":1,"external_links":0,"defined_names":11,"comments":0,"pivot_tables":0},"unopened":[{"sheet":"Module1","index":8,"reason":"part_missing"},{"sheet":"KendallMod","index":9,"reason":"part_missing"}],"bounds":{"document_bytes":16777216,"sheet_cells":100000,"rows_first":2000,"rows_last":500,"rows_between":2000,"halvings":0,"cell_chars":16384,"cell_head_chars":4096},"cells_cut":0,"cells_raw":0,"read":"whole","date_system":"1900"}

{"sheet":"Table 1 SA4","index":0,"n_rows":51,"n_cols":74,"rows_kept":51,"cut":false,"hidden":false,"merged":[[40,0,40,10],[42,0,42,10],[5,4,5,8],[5,9,5,13],[43,0,43,10]]}
["NSW Recorded Crime Statistics - DV assault regional comparison tool, January 2019 to December 2023"]
["Table 1. Domestic violence* related assault incidents recorded by the NSW Police Force, January 2019 to December 2023, by Statistical Area, trend^, ratio to NSW~, rate per 100,000 population and count"]
[]
[]
[]
[null,null,null,null,"Rate per 100,000 population",null,null,null,null,"Number"]
["NSW Statistical Area","Two year trend (%)","Five year trend (annual average % change)","Ratio to NSW","January 2019 - December 2019","January 2020 - December 2020","January 2021 - December 2021","January 2022 - December 2022","January 2023 - December 2023","January 2019 - December 2019","January 2020 - December 2020","January 2021 - December 2021","January 2022 - December 2022","January 2023 - December 2023","2019-01-01","2019-02-01","2019-03-01","2019-04-01","2019-05-01","2019-06-01","2019-07-01","2019-08-01","2019-09-01","2019-10-01","2019-11-01","2019-12-01","2020-01-01","2020-02-01","2020-03-01","2020-04-01","2020-05-01","2020-06-01","2020-07-01","2020-08-01","2020-09-01","2020-10-01","2020-11-01","2020-12-01","2021-01-01","2021-02-01","2021-03-01","2021-04-01","2021-05-01","2021-06-01","2021-07-01","2021-08-01","2021-09-01","2021-10-01","2021-11-01","2021-12-01","2022-01-01","2022-02-01","2022-03-01","2022-04-01","2022-05-01","2022-06-01","2022-07-01","2022-08-01","2022-09-01","2022-10-01","2022-11-01","2022-12-01","2023-01-01","2023-02-01","2023-03-01","2023-04-01","2023-05-01","2023-06-01","2023-07-01","2023-08-01","2023-09-01","2023-10-01","2023-11-01","2023-12-01"]
["Greater Sydney",6,2,0.81490694429999999,332.5,344.3,329.9,339.7,360,17654,18196,17357,18015,19089,1709,1438,1493,1406,1328,1332,1366,1419,1427,1511,1509,1716,1778,1452,1625,1304,1391,1534,1378,1423,1429,1581,1616,1685,1571,1437,1516,1538,1518,1393,1297,1198,1229,1449,1589,1622,1534,1395,1618,1465,1422,1337,1483,1568,1482,1516,1534,1661,1637,1623,1711,1449,1368,1523,1520,1562,1578,1633,1601,1884]
["Baulkham Hills and Hawkesbury","Stable","Stable",0.38274479220000002,171.8,192,178.2,177.5,169.1,432,498,473,482,459,32,23,43,32,38,40,36,33,33,27,48,47,53,40,60,33,42,45,34,32,37,36,42,44,35,42,51,40,48,53,29,29,32,41,30,43,48,35,36,34,45,35,36,43,49,39,41,41,44,42,45,31,38,50,29,37,37,34,36,36]
["Blacktown","Stable","Stable",1.1489720062,592,565.20000000000005,532.20000000000005,502.3,507.6,2233,2233,2151,2085,2107,204,186,209,170,188,160,180,189,167,195,191,194,257,158,205,149,155,180,159,197,180,200,193,200,220,190,231,195,165,173,170,141,139,155,185,187,162,153,184,154,174,144,164,196,161,191,187,215,160,176,185,180,150,179,155,158,177,177,186,224]
["Central Coast","Stable",2.1,1.1481609015000001,474.2,431.6,417.8,483.4,507.2,1631,1498,1456,1688,1771,185,125,151,119,99,99,136,131,140,155,116,175,155,138,126,106,91,115,109,129,108,144,115,162,131,111,121,96,100,109,111,129,99,133,149,167,161,117,154,150,118,134,122,130,122,178,135,167,174,150,148,160,117,133,133,152,127,157,164,156]
["City and Inner South","Stable","Stable",1.0815740453,414.3,439.3,422.2,465.1,477.8,1524,1529,1416,1582,1625,136,151,137,125,105,149,103,120,121,114,113,150,151,122,129,123,107,121,126,119,116,134,142,139,113,152,109,123,121,112,121,87,107,115,113,143,143,118,146,117,129,113,135,144,132,130,143,132,141,143,180,131,112,106,147,143,132,124,122,144]
["Eastern Suburbs",16.2,"Stable",0.66649544000000005,246.6,240.5,262.5,253.4,294.39999999999998,727,662,692,668,776,80,49,53,55,47,51,66,64,47,56,74,85,60,66,55,43,53,45,63,37,50,46,87,57,59,51,52,51,47,60,53,56,63,73,66,61,52,43,58,58,43,60,48,46,65,69,61,65,70,71,72,68,59,43,71,73,66,67,54,62]
["Inner South West","Stable",3.8,0.88598295100000002,326.3,350.3,345,355.3,391.4,2045,2154,2096,2159,2378,209,149,161,148,172,152,160,157,163,207,177,190,196,158,173,147,148,189,174,182,196,183,202,206,160,152,172,176,246,150,157,133,172,197,193,188,144,153,217,166,170,133,202,200,184,161,198,231,213,209,192,155,158,246,197,162,232,189,197,228]
["Inner West","Stable",9.9,0.59024719960000005,169,181,205.9,238.5,260.7,548,566,631,730,798,38,43,39,38,33,47,49,47,46,60,52,56,51,44,47,75,46,34,31,62,42,40,43,51,59,40,65,69,32,48,43,41,45,42,77,70,65,44,61,75,72,44,50,50,58,74,59,78,68,70,67,54,75,62,69,56,59,54,70,94]
["North Sydney and Hornsby","Stable",6.1,0.32575730339999998,109.5,134.30000000000001,128.4,128.6,143.9,483,583,547,547,612,51,46,34,41,39,42,50,41,31,25,53,30,56,43,56,39,58,42,44,46,56,40,64,39,47,32,43,49,73,47,46,43,36,41,43,47,45,55,40,45,50,43,41,50,52,39,48,39,52,51,38,53,49,54,36,46,59,69,54,51]
["Northern Beaches","Stable",-13.2,0.23729378770000001,178.1,131.1,112.3,101.4,104.8,487,351,297,267,276,55,33,43,48,36,36,50,25,40,53,35,33,32,28,30,34,24,38,13,27,40,31,28,26,23,24,25,36,34,21,24,22,25,20,21,22,20,26,20,29,22,19,19,13,22,22,25,30,18,23,19,24,25,15,16,25,25,24,28,34]
["Outer South West","Stable","Stable",1.0233697718999999,447,452,430.2,452.4,452.1,1293,1332,1287,1376,1375,127,111,116,103,105,79,72,99,103,118,131,129,152,107,129,80,86,115,104,105,91,100,130,133,138,106,90,139,90,105,96,74,88,124,134,103,112,122,129,110,101,103,98,139,127,106,113,116,120,120,111,90,84,76,109,116,136,126,130,157]
["Outer West and Blue Mountains",16.3,"Stable",1.1792581476999999,511.6,542.70000000000005,444.7,448,520.9,1675,1799,1486,1506,1751,144,120,128,153,128,129,123,127,157,156,125,185,165,131,150,120,157,189,148,129,137,176,158,139,124,134,118,129,140,105,89,106,112,126,144,159,142,119,120,153,118,139,111,125,111,120,122,126,135,137,177,150,117,127,131,138,139,160,136,204]
["Parramatta","Stable","Stable",0.9065874465,350.4,409,369,395.1,400.5,1763,2054,1834,1970,1997,169,159,127,139,143,142,121,164,152,130,136,181,192,174,206,135,184,180,153,127,152,175,169,207,188,174,173,161,184,153,147,114,103,126,154,157,155,173,164,163,161,172,222,172,129,150,166,143,187,164,175,130,149,156,178,187,159,159,173,180]
["Ryde","Stable",-5.8,0.35124863029999998,197.3,209.4,188.2,152.69999999999999,155.19999999999999,404,428,382,313,318,34,21,46,43,36,36,37,27,32,27,32,33,37,40,23,42,48,45,27,32,35,34,32,33,42,34,39,38,41,30,24,27,24,23,31,29,33,26,29,24,34,12,27,27,25,30,22,24,24,24,22,19,22,31,24,35,21,32,15,49]
["South West",15.6,7.1,1.0543067102000001,378.5,396.2,406.2,403,465.7,1721,1857,1935,1958,2263,174,158,151,125,117,121,128,146,149,137,147,168,154,149,164,133,140,156,147,148,150,175,140,201,158,144,162,183,145,170,125,143,131,187,194,193,175,156,188,133,138,127,157,189,186,170,157,182,186,198,211,148,168,198,175,188,167,224,184,216]
["Sutherland",-14.8,"Stable",0.57060627770000005,298.89999999999998,284.3,292.5,295.7,252.1,688,652,674,684,583,71,64,55,67,42,49,55,49,46,51,79,60,67,54,72,45,52,40,46,51,39,67,71,48,74,51,65,53,52,57,62,53,53,46,55,53,77,55,72,54,47,59,51,44,59,37,57,72,45,45,69,56,45,47,50,46,42,37,52,49]
["Regional NSW",7.6,5.5,1.3419529218999999,492.9,501.1,520.9,551.1,592.79999999999995,13688,14079,14769,15778,16972,1364,1113,1144,1031,966,1019,997,1083,1101,1165,1267,1438,1382,1125,1182,949,1064,1098,935,1166,1189,1213,1297,1479,1458,1224,1234,1157,1230,1271,1109,1107,1060,1177,1250,1492,1480,1294,1329,1139,1244,1114,1213,1318,1317,1409,1398,1523,1570,1417,1474,1252,1250,1307,1402,1441,1331,1401,1484,1643]
["Capital Region",15.7,11.2,1.0234827067000001,309.7,355.2,362.1,390.6,452.1,712,837,864,940,1088,72,44,45,54,50,50,72,54,71,63,71,66,67,71,62,55,80,66,40,72,66,75,84,99,75,82,64,63,79,67,61,80,59,67,73,94,94,80,66,63,74,75,76,80,75,87,93,77,94,86,73,91,90,95,94,99,102,100,81,83]
["Central West","Stable",3.2,1.4758040292000001,577.4,577.5,654.20000000000005,698.6,651.9,1232,1231,1397,1496,1396,127,112,101,95,94,83,89,98,93,119,119,102,127,118,121,73,82,86,72,106,110,93,119,124,114,113,114,129,131,134,108,106,104,113,109,122,121,122,117,113,133,108,136,128,90,162,121,145,136,118,123,107,113,96,121,133,106,95,125,123]
["Coffs Harbour - Grafton",31.1,15.9,1.8474869685999999,469.8,557.79999999999995,526.70000000000005,622.4,816.1,667,804,770,919,1205,71,47,42,49,52,54,50,54,46,61,55,86,67,65,68,50,48,55,59,78,81,80,72,81,87,56,69,60,66,83,64,57,48,52,58,70,78,83,79,54,66,71,74,66,102,108,71,67,113,91,104,81,95,94,112,90,86,95,114,130]
["Far West and Orana",16.7,3.9,3.7786192140999999,1435.7,1379.9,1392.7,1430.1,1669.2,1679,1617,1632,1675,1955,176,126,165,100,123,151,87,141,126,159,158,167,214,133,148,93,125,117,100,124,138,130,153,142,165,147,112,134,140,131,133,117,117,125,121,190,164,119,131,110,163,122,127,127,151,142,151,168,156,152,177,141,140,144,156,157,171,173,193,195]
["Hunter Valley excluding Newcastle",20.100000000000001,10,1.5158188661000001,489,479.2,480.8,557.5,669.6,1372,1376,1409,1670,2006,133,124,115,123,83,91,79,110,109,129,118,158,122,107,120,108,102,118,107,108,109,112,109,154,139,146,127,98,125,110,103,120,97,102,107,135,148,160,136,122,120,130,114,162,131,121,154,172,183,155,146,150,123,149,185,199,173,171,169,203]
["Illawarra","Stable","Stable",0.69552183030000003,303,309.39999999999998,295.10000000000002,295.89999999999998,307.2,953,966,927,940,976,96,87,71,76,95,66,74,68,68,63,90,99,77,87,90,73,65,81,76,61,118,74,69,95,118,64,82,82,72,82,72,60,52,80,82,81,81,78,69,68,87,76,76,71,64,92,89,89,87,76,85,75,67,72,84,87,80,77,84,102]
["Mid North Coast","Stable",9.6,1.5179526932,484.1,512.29999999999995,598.29999999999995,601.6,670.6,1078,1160,1370,1395,1555,77,87,82,89,70,71,98,95,80,112,102,115,98,92,97,77,75,66,64,101,98,114,128,150,132,121,122,90,105,131,101,103,95,96,128,146,160,115,91,86,97,92,97,119,127,114,140,157,182,138,143,105,117,115,134,100,118,132,124,147]
["Murray","Stable",7,1.3684777378999999,475.6,491.8,564.9,608.5,604.5,575,601,697,758,753,55,38,51,34,35,43,52,59,43,40,61,64,57,66,59,36,53,45,33,60,45,47,45,55,70,72,53,41,44,49,37,54,59,65,76,77,76,67,57,53,51,40,54,79,77,56,79,69,57,67,63,40,64,58,61,91,66,68,55,63]
["New England and North West","Stable",5.4,1.9888039924000001,716.4,757.4,811.9,850.9,878.6,1340,1418,1518,1599,1651,145,106,117,93,93,107,97,95,112,99,126,150,144,110,99,91,118,133,99,113,103,132,114,162,147,98,147,125,132,130,95,123,119,136,122,144,149,138,157,122,109,123,128,129,119,127,142,156,147,131,142,125,112,123,146,133,114,132,153,193]
["Newcastle and Lake Macquarie","Stable",2.2999999999999998,0.97559353910000002,412,375.3,389.2,421.9,431,1560,1452,1523,1672,1708,143,121,136,126,91,119,125,127,140,137,145,150,136,92,123,107,120,110,92,115,110,128,160,159,131,121,118,128,126,124,115,110,107,130,144,169,145,145,176,138,139,116,129,123,112,161,136,152,170,151,147,137,143,139,130,142,104,131,156,158]
["Richmond - Tweed","Stable","Stable",0.85209234,361,380.5,424,418.5,376.4,912,970,1089,1083,974,99,90,92,64,74,58,81,61,81,42,75,95,87,51,67,56,72,73,70,83,89,95,108,119,113,96,86,73,93,95,75,69,82,81,115,111,111,93,90,90,88,65,86,91,87,95,89,98,78,95,90,81,73,76,69,65,90,86,71,100]
["Riverina","Stable","Stable",1.5377449687,691.9,656.6,609.29999999999995,637.4,679.3,1118,1074,1001,1049,1118,107,90,80,96,73,95,60,103,87,99,94,134,123,84,82,88,80,99,85,89,74,92,84,94,100,58,98,82,74,91,95,60,88,74,78,103,82,60,107,83,73,61,75,97,124,83,87,117,117,102,114,76,79,97,59,98,78,94,116,88]
["Southern Highlands and Shoalhaven","Stable","Stable",0.81939839569999995,312.89999999999998,361,355.7,358.9,362,490,573,572,582,587,63,41,47,32,33,31,33,18,45,42,53,52,63,49,46,42,44,49,38,56,48,41,52,45,67,50,42,52,43,44,50,48,33,56,37,50,71,34,53,37,44,35,41,46,58,61,46,56,50,55,67,43,34,49,51,47,43,47,43,58]
["NSW",6.7,3.6,1,387.6,398.8,396.8,413.9,441.7,31349,32280,32132,33797,36072,3073,2551,2637,2439,2295,2351,2363,2502,2528,2676,2779,3155,3160,2577,2807,2253,2455,2633,2313,2591,2619,2794,2914,3164,3030,2661,2751,2695,2749,2664,2407,2306,2290,2626,2839,3114,3015,2690,2947,2604,2666,2451,2696,2886,2800,2926,2932,3184,3207,3040,3186,2701,2618,2830,2923,3005,2910,3034,3089,3529]
[]
["Notes:"]
["*NSW Police flag whether criminal incidents that they record on their COPS (Computerised Operational Policing System) database are domestic violence-related. New South Wales police define domestic assault in line with the Crimes (Domestic and Personal Violence) Act 2007. Under this legislation a person has a domestic relationship with another if they are a spouse/partner, ex spouse/ex partner, boy/girlfriend (including ex), parent/guardian (including step/foster), child (including step/foster), sibling, other member of family (including kin), is living or has lived in the same household as other person, is dependant on the paid or unpaid care of the other person, or are involved in a \"love triangle\" (e.g. a woman’s ex-partner and current partner would have a domestic relationship with each other for the purposes of this Act even if they had never met). "]
[]
["^BOCSAR relies upon the Kendall Rank Order Correlation statistical test (or Kendall's tau-b) to determine whether a series is trending upwards, downwards or is stable (p<.05).  The statistical test is applied to the monthly count data over the specified period. Where a significant trend is found, the average annual percentage change over the time period is reported. If any of the 12-monthly totals in the series have a value of less than 20, a trend test is not conducted. When this occurs, the relevant cell will be left blank or contain 'n.c.' (not calculated).  Significant upward tends are in red and significant downward trends are in yellow."]
["~The ratio to NSW rate statistics are a comparison of a NSW regional rate per 100,000 population to the  NSW rate per 100,000 population. A ratio of one indicates parity with the NSW rate. Ratios indicating double the NSW rate (or more) before rounding are highlighted in red, whilst ratios indicating half the NSW rate (or less) before rounding are highlighted in yellow. Ratios are not calculated for regions with a population of less than 3,000. "]
[]
["For the rate calculations, specialised population data were prepared and provided to BOCSAR by the Australian Bureau of Statistics."]
[]
["Source: NSW Bureau of Crime Statistics and Research"]
["Please retain this reference number for future correspondence."]
["NOTE: Data sourced from the NSW Bureau of Crime Statistics and Research must be acknowledged in any document (electronic or otherwise) containing that data."]
["The acknowledgement should take the form of 'Source: NSW Bureau of Crime Statistics and Research'."]

{"sheet":"Table 2 LGA","index":1,"n_rows":154,"n_cols":75,"rows_kept":154,"cut":false,"hidden":false,"merged":[[148,0,148,10],[5,5,5,9],[5,10,5,14],[141,0,141,10],[143,0,143,10],[144,0,144,10]]}
["NSW Recorded Crime Statistics - DV assault regional comparison tool, January 2019 to December 2023"]
["Table 2. Domestic violence* related assault incidents recorded by the NSW Police Force, January 2019 to December 2023, by Local Government Area, trend^, ratio to NSW~, rank, rate per 100,000 population and count"]
[]
[]
[]
[null,null,null,null,null,"Rate per 100,000 population",null,null,null,null,"Number"]
["NSW Local Government Area","Two year trend (%)","Five year trend (annual average % change)","Ratio to NSW","Rank","January 2019 - December 2019","January 2020 - December 2020","January 2021 - December 2021","January 2022 - December 2022","January 2023 - December 2023","January 2019 - December 2019","January 2020 - December 2020","January 2021 - December 2021","January 2022 - December 2022","January 2023 - December 2023","2019-01-01","2019-02-01","2019-03-01","2019-04-01","2019-05-01","2019-06-01","2019-07-01","2019-08-01","2019-09-01","2019-10-01","2019-11-01","2019-12-01","2020-01-01","2020-02-01","2020-03-01","2020-04-01","2020-05-01","2020-06-01","2020-07-01","2020-08-01","2020-09-01","2020-10-01","2020-11-01","2020-12-01","2021-01-01","2021-02-01","2021-03-01","2021-04-01","2021-05-01","2021-06-01","2021-07-01","2021-08-01","2021-09-01","2021-10-01","2021-11-01","2021-12-01","2022-01-01","2022-02-01","2022-03-01","2022-04-01","2022-05-01","2022-06-01","2022-07-01","2022-08-01","2022-09-01","2022-10-01","2022-11-01","2022-12-01","2023-01-01","2023-02-01","2023-03-01","2023-04-01","2023-05-01","2023-06-01","2023-07-01","2023-08-01","2023-09-01","2023-10-01","2023-11-01","2023-12-01"]
["Albury","Stable",8.9,1.6698542692,33,546.5,592.6,722.4,720,737.7,297,328,405,408,418,24,29,31,14,13,22,28,31,27,22,25,31,27,38,36,20,33,22,12,33,23,25,30,29,34,45,31,22,22,31,23,33,30,36,48,50,39,49,34,25,23,19,30,42,35,32,41,39,35,27,32,23,37,30,35,54,34,48,32,31]
["Armidale Regional","Stable","Stable",1.6422845186999999,34,603.79999999999995,619.29999999999995,808,684.6,725.5,180,183,237,201,213,20,14,17,6,20,17,10,18,11,16,12,19,13,11,22,12,15,14,18,17,17,17,8,19,20,11,29,17,24,26,14,18,12,18,25,23,21,18,16,16,13,17,12,15,9,22,15,27,22,17,14,19,11,19,21,19,13,19,18,21]
["Ballina","Stable","Stable",0.57499254369999997,99,219.6,280.89999999999998,318.2,305.2,254,98,128,147,143,119,7,10,14,16,4,5,10,4,12,5,4,7,7,8,10,5,12,9,2,8,7,20,12,28,13,15,18,7,8,13,12,7,8,10,27,9,21,10,9,12,10,10,10,8,10,12,16,15,4,8,11,9,7,14,11,5,12,14,9,15]
["Balranald","n.c.","n.c.",".","n.c.","      . ","      . ","      . ","      . ","      . ",10,13,7,9,6,0,0,1,0,0,1,4,0,0,0,3,1,1,1,2,0,1,2,2,0,0,0,1,3,1,0,1,0,0,0,1,0,1,0,2,1,2,0,0,0,0,0,0,1,2,0,2,2,1,0,1,1,0,0,1,0,0,1,0,1]
["Bathurst Regional","Stable",6.5,1.5703249264000001,38,545.70000000000005,549,767,711.8,693.7,238,238,335,314,306,26,15,17,15,20,17,15,21,22,23,19,28,14,23,30,12,17,11,19,16,23,23,23,27,24,24,35,26,36,49,26,19,15,29,18,34,25,23,19,30,25,23,28,23,21,38,20,39,34,30,23,24,32,20,27,23,25,16,25,27]
["Bayside","Stable","Stable",0.84470902969999995,74,362.2,380.6,355.8,388.9,373.1,646,669,627,692,664,61,46,40,57,46,68,50,39,51,50,70,68,64,52,66,51,54,51,69,58,52,44,60,48,48,64,49,58,67,38,51,45,46,50,51,60,56,47,63,56,65,44,61,74,52,46,67,61,72,64,68,51,37,63,54,55,60,43,46,51]
["Bega Valley","Stable","Stable",0.62902388259999997,95,295.89999999999998,333.7,349.5,280.60000000000002,277.89999999999998,102,118,125,101,100,6,8,5,13,9,4,13,6,14,6,14,4,6,12,13,7,12,10,8,7,9,8,8,18,14,17,8,7,16,4,5,12,9,8,15,10,10,15,7,11,9,10,5,6,5,6,10,7,10,5,7,8,12,13,4,6,10,11,6,8]
["Bellingen","Stable","Stable",1.1265740900000001,56,323.3,434.3,378.7,316.7,497.7,42,57,50,42,66,6,3,0,4,2,3,5,4,2,6,0,7,2,7,5,5,2,6,5,6,9,4,1,5,9,3,5,5,4,10,3,0,3,3,2,3,1,8,0,2,3,0,2,1,7,8,6,4,7,10,5,8,7,0,9,2,3,6,5,4]
["Berrigan","Stable","n.c.",1.5435125133000001,40,171.4,196.9,267,543.20000000000005,681.8,15,17,23,47,59,2,0,1,1,1,0,1,5,0,1,0,3,1,1,1,0,1,1,2,3,0,3,1,3,2,0,2,1,3,1,0,1,2,6,3,2,3,3,2,3,4,4,2,6,3,7,7,3,2,8,7,1,6,3,3,12,8,4,2,3]
["Blacktown","Stable","Stable",1.1530844213,54,594.1,563.79999999999995,534.9,503,509.4,2224,2205,2139,2067,2093,204,185,209,169,188,158,180,189,166,193,190,193,257,155,202,148,154,173,158,196,176,196,192,198,220,190,231,192,164,169,169,140,139,154,184,187,159,153,181,153,173,143,162,194,161,191,185,212,160,176,184,178,149,176,155,157,177,175,185,221]
["Bland",95.8,"Stable",1.9365737894999999,20,335,354.7,739.5,436.8,855.5,20,20,41,24,47,1,3,2,4,0,3,0,2,2,1,2,0,2,2,2,0,0,3,1,2,1,3,3,1,4,11,1,2,0,1,4,0,12,3,1,2,0,2,0,0,2,1,3,1,8,2,4,1,0,1,6,7,3,3,0,7,8,1,6,5]
["Blayney","Stable","Stable",0.92445877499999995,70,284.60000000000002,455.2,386.1,382,408.4,21,34,29,29,31,2,2,3,1,3,0,3,0,1,2,3,1,5,0,4,1,1,2,1,3,1,4,4,8,3,5,2,1,1,5,2,0,1,2,4,3,1,3,3,3,0,1,1,2,0,5,2,8,2,2,1,3,0,2,4,3,4,4,2,4]
["Blue Mountains","Stable",7.2,0.67116128939999997,91,221.2,271.3,268,318.3,296.5,175,214,210,248,231,19,14,13,23,9,12,11,11,17,15,6,25,16,14,14,12,24,30,18,16,16,15,24,15,6,20,24,18,16,23,12,11,15,22,24,19,20,12,19,26,11,32,25,23,17,18,20,25,19,23,24,19,18,23,24,14,15,17,10,25]
["Bogan","Stable","n.c.",".","n.c.","      . ","      . ","      . ","      . ","      . ",23,21,17,32,26,3,5,0,1,1,2,2,0,2,1,1,5,0,1,2,1,4,1,2,4,1,2,1,2,1,3,2,0,3,1,0,1,1,0,1,4,8,1,1,4,0,2,1,4,6,1,2,2,3,2,6,0,7,1,0,3,0,0,3,1]
["Bourke",46.7,15.4,".","n.c.","      . ","      . ","      . ","      . ","      . ",101,120,121,122,179,12,9,9,5,8,7,7,6,10,8,11,9,7,10,13,7,6,11,3,12,14,9,16,12,16,9,5,11,18,10,11,11,4,7,8,11,11,10,4,5,15,12,11,10,7,11,12,14,12,16,7,16,19,13,16,20,15,13,23,9]
["Brewarrina","Stable","Stable",".","n.c.","      . ","      . ","      . ","      . ","      . ",61,67,66,54,61,2,5,5,2,3,3,2,11,3,14,4,7,12,4,4,4,1,6,3,4,8,8,10,3,5,11,5,4,1,7,2,4,3,12,6,6,5,6,6,5,3,6,0,6,4,3,4,6,6,1,3,3,4,7,11,7,7,4,5,3]
["Broken Hill",40.6,15.2,4.599874894,2,1161.5,1390.8,1307.9000000000001,1445.7,2032,203,246,231,254,357,23,16,10,18,19,18,13,14,22,15,12,23,36,24,24,13,18,14,14,18,14,26,22,23,30,24,15,13,10,24,19,12,18,25,20,21,29,10,13,20,19,8,30,25,25,23,21,31,24,23,45,25,16,37,21,22,39,37,23,45]
["Burwood","Stable",19.399999999999999,0.67636951450000005,90,147.80000000000001,170.1,227.5,259.60000000000002,298.8,60,69,92,106,122,5,4,2,5,6,6,5,2,8,7,3,7,3,4,7,7,2,1,1,14,8,8,10,4,5,5,15,5,5,5,4,10,10,6,11,11,5,6,11,13,9,5,11,6,6,16,7,11,8,11,11,7,8,10,8,9,9,14,10,17]
["Byron","Stable","Stable",0.66343257440000003,93,319.3,294.7,354.5,331.4,293.10000000000002,112,105,128,121,107,9,10,12,10,6,11,5,9,10,4,12,14,10,9,8,11,9,5,14,11,2,7,7,12,11,11,8,18,11,13,9,8,10,12,8,9,12,15,8,8,6,9,11,14,11,14,9,4,10,12,14,8,9,8,7,6,8,10,6,9]
["Cabonne","Stable","Stable",0.6704202333,92,249.4,217.6,232.4,303.39999999999998,296.2,34,30,32,42,41,3,1,3,0,2,4,5,2,0,4,8,2,1,6,2,2,3,0,0,1,4,2,5,4,4,0,0,5,1,2,3,0,1,4,10,2,2,3,8,3,4,6,0,3,2,2,4,5,4,2,1,1,2,3,5,5,4,5,7,2]
["Camden","Stable","Stable",0.60044509599999996,96,383.6,300.5,277.3,255.9,265.2,389,337,333,327,339,43,40,42,28,27,22,28,32,21,28,48,30,31,30,44,28,21,24,16,38,26,25,24,30,42,16,26,27,23,30,29,26,27,34,30,23,30,33,36,17,22,21,33,28,29,27,29,22,33,23,29,15,21,17,32,34,33,36,35,31]
["Campbelltown","Stable",3.5,1.2877155538,50,523.1,559.4,530.4,571.1,568.79999999999995,894,981,943,1030,1026,81,78,76,66,78,63,46,76,76,86,80,88,119,75,85,54,63,86,84,70,70,75,100,100,93,84,65,102,68,76,69,48,62,81,107,88,78,81,97,83,72,78,74,114,93,85,86,89,92,91,82,71,61,64,74,79,101,96,95,120]
["Canada Bay","Stable",13,0.459293059,106,115.6,132,146.1,170.4,202.9,111,121,131,152,181,7,11,7,9,10,4,13,12,4,10,13,11,8,5,10,19,7,8,10,20,11,8,7,8,12,5,16,17,5,8,13,4,8,7,17,19,20,6,10,23,10,10,9,9,16,8,12,19,17,20,14,17,18,15,19,12,13,9,10,17]
["Canterbury-Bankstown",22.7,8.4,1.0215404253,63,321.3,362.3,366.2,367.7,451.3,1214,1362,1364,1368,1679,128,78,102,83,103,97,87,109,98,113,97,119,114,98,100,94,91,133,120,118,109,121,130,134,113,99,108,121,160,100,95,85,120,126,131,106,103,105,120,110,104,87,140,101,122,108,116,152,147,138,134,106,112,158,143,111,165,146,156,163]
["Carrathool","n.c.","n.c.",".","n.c.","      . ","      . ","      . ","      . ","      . ",12,21,21,18,19,4,2,1,0,0,0,0,0,0,0,0,5,1,0,2,0,2,1,2,2,2,2,3,4,0,1,3,1,5,1,2,0,0,0,6,2,1,3,3,0,1,1,0,1,0,3,1,4,0,1,1,0,2,2,1,2,0,1,6,3]
["Central Coast","Stable",2.1,1.1481609015000001,55,474.2,431.6,417.5,483.4,507.2,1631,1498,1455,1688,1771,185,125,151,119,99,99,136,131,140,155,116,175,155,138,126,106,91,115,109,129,108,144,115,162,131,111,121,96,100,108,111,129,99,133,149,167,161,117,154,150,118,134,122,130,122,178,135,167,174,150,148,160,117,133,133,152,127,157,164,156]
["Central Darling",66.2,"Stable",".","n.c.","      . ","      . ","      . ","      . ","      . ",100,85,114,77,128,3,5,12,8,5,3,9,12,7,16,11,9,10,6,7,4,2,10,9,7,8,6,5,11,8,9,8,10,11,8,12,14,7,9,7,11,15,5,5,6,4,7,7,5,7,4,11,1,7,8,13,14,7,10,14,10,7,5,14,19]
["Cessnock",38.200000000000003,12.2,1.6150363398000001,36,495.2,420.6,471,516.1,713.4,297,262,302,340,470,17,32,31,41,18,15,14,31,19,26,26,27,10,15,22,17,19,32,23,27,21,18,26,32,45,28,26,29,20,26,28,21,12,19,18,30,40,36,32,23,9,21,19,32,39,24,32,33,36,34,38,37,23,44,38,62,45,42,38,33]
["Clarence Valley",36.4,19.600000000000001,1.552996928,39,354.3,413,372.6,503.1,686,183,218,202,275,375,27,12,6,17,14,15,10,10,14,19,17,22,21,24,13,13,8,17,8,15,21,24,20,34,16,16,19,19,17,22,20,18,13,12,15,15,26,11,25,21,19,23,27,27,20,25,28,23,37,23,23,25,24,31,34,31,28,28,49,42]
["Cobar","Stable","Stable",1.7344455168999999,29,612.4,475.5,512.4,766.2,766.2,28,20,21,31,31,1,3,4,3,3,3,1,3,2,3,1,1,1,1,5,2,0,2,0,5,0,2,2,0,3,1,1,0,7,1,2,2,1,0,2,1,0,4,4,1,4,3,1,2,2,4,1,5,1,2,1,2,3,5,5,5,1,3,3,0]
["Coffs Harbour","Stable",14.7,2.1693202856,12,572.1,676.1,657.5,755.1,958.3,442,529,518,602,764,38,32,36,28,36,36,35,40,30,36,38,57,44,34,50,32,38,32,46,57,51,52,51,42,62,37,45,36,45,51,41,39,32,37,41,52,51,64,54,31,44,48,45,38,75,75,37,40,69,58,76,48,64,63,69,57,55,61,60,84]
["Coolamon","n.c.","n.c.",0.35489626070000002,111,230.4,227.5,227.1,246.4,156.80000000000001,10,10,10,11,7,2,0,0,0,1,0,0,2,2,0,1,2,0,1,1,0,1,1,0,2,0,2,1,1,1,1,1,1,1,2,1,0,1,0,0,1,1,1,0,1,4,0,0,2,1,1,0,0,1,0,0,1,0,1,0,0,3,0,1,0]
["Coonamble","Stable",-13.1,4.0244109312000003,4,3007.3,2535.6,2504.6,1542.5,1777.8,119,98,96,59,68,10,10,8,4,8,17,5,5,14,13,13,12,16,7,18,6,12,3,4,6,9,8,6,3,6,13,5,6,10,10,11,8,5,7,9,6,5,2,7,5,2,2,5,4,4,6,4,13,11,3,6,4,4,2,4,10,5,5,4,10]
["Cootamundra-Gundagai","Stable","Stable",1.5880260602,37,471.8,562.79999999999995,412.6,508.6,701.5,53,64,47,58,80,3,4,4,7,5,9,6,4,1,2,3,5,7,5,2,7,5,6,3,7,8,7,4,3,5,6,3,2,2,3,4,4,3,1,5,9,3,3,2,10,2,5,4,7,7,1,3,11,6,12,8,3,6,7,4,6,5,10,9,4]
["Cowra",-27.7,"Stable",1.3006877124,49,494.5,660.4,627,795,574.6,63,84,80,101,73,6,7,2,6,8,5,0,9,2,3,3,12,4,6,5,4,8,10,5,10,4,11,10,7,10,5,2,1,8,8,5,6,9,10,6,10,14,15,8,7,8,3,7,11,5,7,10,6,10,2,7,11,3,8,6,7,9,5,2,3]
["Cumberland","Stable","Stable",0.96205236679999995,67,383.1,446.4,370.8,407.7,425,925,1073,879,968,1009,88,69,66,80,68,94,58,87,78,66,71,100,103,96,101,70,90,99,83,55,89,96,81,110,84,89,84,77,88,96,86,40,37,62,64,72,97,84,82,72,77,83,93,93,66,77,72,72,86,78,89,67,73,81,82,85,89,85,99,95]
["Dubbo Regional","Stable","Stable",2.6689784719,7,1297.7,1149.2,1096.7,1198.7,1179,697,631,609,670,659,74,44,82,45,51,59,28,69,46,64,67,68,88,61,47,29,53,44,38,54,59,45,65,48,57,36,45,63,47,45,45,48,59,42,38,84,58,60,70,47,78,60,43,36,59,56,55,48,46,68,54,55,50,36,50,52,55,62,66,65]
["Dungog","Stable","n.c.",0.76839259319999997,78,191,381.8,293.7,401.2,339.4,18,36,28,39,33,3,2,2,3,2,3,1,0,0,0,2,0,6,1,6,0,3,6,1,1,6,1,4,1,4,4,3,2,0,2,1,3,4,1,3,1,6,6,3,2,3,1,1,10,0,0,2,5,5,2,5,1,2,2,4,3,3,2,1,3]
["Edward River","Stable","Stable",1.9004955843,21,627.5,668,746.7,898.7,839.5,57,57,63,76,71,7,1,4,1,7,3,6,2,2,8,10,6,6,8,2,4,3,3,4,8,3,5,1,10,6,7,6,7,5,4,1,3,9,7,1,7,7,5,5,7,11,6,10,3,12,1,6,3,2,8,4,2,9,11,2,8,2,4,7,12]
["Eurobodalla","Stable",17.3,1.4219486544,44,350.9,486.9,548.6,552.1,628.1,135,194,222,225,256,14,12,9,11,13,14,12,14,5,8,13,10,11,19,11,17,18,16,8,22,19,13,15,25,21,16,7,16,31,22,12,21,19,10,15,32,37,12,19,7,16,20,13,20,16,28,12,25,22,19,19,27,20,27,18,22,23,25,19,15]
["Fairfield","Stable",5.2,1.0147039389000001,64,357.7,363.1,381.7,440.5,448.2,757,769,798,911,927,91,73,65,55,55,48,56,63,68,55,54,74,60,61,69,52,71,76,44,41,70,74,66,85,57,74,62,69,54,89,47,66,50,67,87,76,75,83,71,70,68,79,94,85,78,77,63,68,66,87,93,56,75,75,79,77,75,72,74,98]
["Federation","Stable","Stable",0.56355528830000001,102,289.5,314.89999999999998,226.2,342.3,248.9,36,40,29,44,32,3,1,6,2,0,2,3,3,6,3,3,4,5,3,5,5,4,2,4,3,0,2,5,2,3,4,6,6,2,1,0,2,1,3,1,0,3,2,3,3,2,2,2,8,4,0,4,11,3,4,4,1,2,1,4,2,3,1,4,3]
["Forbes","Stable","Stable",1.7210077264000001,30,797.7,864.6,788.5,621.1,760.3,79,82,74,58,71,9,8,8,5,6,3,2,4,9,8,11,6,8,4,9,5,11,8,7,4,7,6,3,10,7,5,4,7,9,4,9,10,7,2,4,6,4,6,3,3,1,7,7,8,2,4,9,4,15,3,9,6,4,1,0,4,8,5,5,11]
["Georges River","Stable","Stable",0.58649711950000005,97,309.2,287.3,282.7,292.39999999999998,259.10000000000002,493,447,432,448,397,45,41,36,33,41,22,43,42,42,59,42,47,46,36,35,26,30,31,28,31,53,39,44,48,30,28,38,30,40,38,43,32,31,42,32,48,22,34,55,29,36,28,37,47,31,27,46,56,28,46,44,26,32,50,32,27,27,26,21,38]
["Gilgandra","Stable","Stable",1.9483147826,18,990.8,1249.7,1111.5999999999999,814.1,860.7,42,54,48,35,37,9,2,9,0,4,3,1,1,0,5,3,5,8,5,4,0,2,4,4,1,8,4,4,10,5,11,6,1,3,4,4,3,0,3,7,1,2,2,4,1,1,4,4,2,7,1,4,3,3,3,5,4,5,1,7,1,2,1,3,2]
["Glen Innes Severn","Stable","Stable",2.0751923332,15,732.9,817.6,728.3,704.3,916.7,65,73,65,63,82,9,4,5,3,10,5,3,1,5,3,11,6,9,1,4,10,5,2,8,6,10,7,8,3,14,3,3,5,2,8,6,9,7,1,4,3,7,6,5,4,1,6,6,5,6,5,7,5,3,4,12,7,5,10,8,7,8,5,7,6]
["Goulburn Mulwaree",25,15.8,1.4310623088000001,42,366.2,417.3,357.7,505.7,632.20000000000005,114,133,115,164,205,11,9,7,8,7,11,10,10,16,7,6,12,16,14,6,8,14,5,9,9,8,6,20,18,16,5,19,9,5,11,16,9,4,7,5,9,13,13,13,15,10,9,16,7,15,17,21,15,19,15,11,13,17,13,25,18,21,16,17,20]
["Greater Hume Shire","Stable","Stable",0.72330097950000005,83,288,284.2,297.10000000000002,363.9,319.5,31,31,33,41,36,5,2,2,4,3,3,0,1,1,1,5,4,5,1,2,2,3,5,0,5,3,2,1,2,5,6,1,3,1,3,4,2,3,2,1,2,3,0,4,7,2,3,3,3,3,6,3,4,3,4,1,2,5,1,2,8,1,3,2,4]
["Griffith","Stable","Stable",1.8603254425,24,825.3,816.4,702.3,662.6,821.8,223,222,191,179,222,21,21,16,16,11,21,8,19,22,21,18,29,26,17,31,16,7,20,17,15,14,13,18,28,23,11,13,9,12,17,17,14,23,15,18,19,15,9,16,14,10,7,15,18,27,19,16,13,19,21,25,14,20,23,10,14,20,10,24,22]
["Gunnedah","Stable",8.4,1.9978150735,17,662.5,730.7,687.7,836.9,882.5,84,95,90,110,116,9,3,5,5,4,5,5,12,3,15,8,10,9,7,6,7,2,15,7,6,1,9,11,15,6,4,7,11,6,3,7,4,10,8,10,14,11,10,15,5,6,5,12,11,9,7,8,11,6,8,15,9,8,8,8,15,8,4,13,14]
["Gwydir","n.c.","n.c.",1.1033620547,58,373.7,678.6,223.9,264,487.4,20,34,11,13,24,3,1,2,4,1,2,0,2,2,1,0,2,8,1,3,6,1,4,0,2,3,2,4,0,1,1,5,0,1,0,0,0,1,0,0,2,0,1,2,2,1,0,1,1,2,1,1,1,2,0,1,0,0,2,2,1,1,2,5,8]
["Hawkesbury","Stable",7,1.0307578984000001,62,350.7,416.6,365.4,421.4,455.3,236,281,247,286,309,24,16,21,23,23,26,20,15,15,21,16,16,24,21,21,22,21,39,17,21,16,29,23,27,11,25,19,15,18,20,21,17,19,26,24,32,37,10,26,22,20,22,22,23,22,28,26,28,22,18,38,32,25,29,20,18,14,29,23,41]
["Hay","n.c.","n.c.",".","n.c.","      . ","      . ","      . ","      . ","      . ",21,28,25,19,21,0,0,0,4,4,2,0,4,3,1,3,0,1,4,3,2,1,2,2,1,7,5,0,0,4,2,1,0,0,1,0,1,5,3,7,1,2,2,3,1,0,3,1,2,1,1,3,0,3,1,4,0,2,3,1,0,3,1,0,3]
["Hilltops","Stable",13.5,1.7767212613000001,27,486.6,521.79999999999995,567,649.70000000000005,784.9,91,100,109,125,151,10,5,7,9,11,1,6,10,7,13,6,6,12,7,6,4,13,5,2,7,4,20,10,10,10,16,4,7,5,12,9,7,3,12,10,14,16,17,9,10,13,15,12,10,1,5,11,6,17,18,8,13,5,16,25,14,7,9,7,12]
["Hornsby","Stable","Stable",0.34310936240000001,112,142.80000000000001,175.6,157.6,148.9,151.6,217,270,240,226,230,21,21,21,16,19,14,19,23,11,12,27,13,28,23,20,17,17,31,21,31,27,18,16,21,20,15,23,16,35,21,24,18,17,19,13,19,20,18,12,21,26,21,13,17,22,17,25,14,21,21,19,19,16,24,16,21,20,20,15,18]
["Hunters Hill","n.c.","n.c.",0.21135094039999999,119,160.30000000000001,136.30000000000001,125,122.1,93.4,24,19,17,17,13,5,0,3,4,3,2,1,1,0,2,0,3,1,4,3,1,3,1,1,2,1,1,0,1,0,4,2,2,4,1,1,0,1,0,0,2,2,0,0,1,2,3,1,1,2,1,2,2,1,2,0,2,1,1,1,1,0,3,0,1]
["Inner West",14.2,6.9,0.69480183809999996,89,214.2,220.9,249.7,268.7,306.89999999999998,430,419,459,492,562,44,36,37,29,24,41,29,42,31,42,33,42,44,32,29,49,38,28,18,39,31,32,32,47,39,35,44,48,36,34,33,32,31,29,52,46,37,25,37,37,55,36,33,41,53,56,43,39,51,43,53,42,47,25,52,41,53,38,56,61]
["Inverell","Stable","Stable",2.4696165265999999,10,1036.5,857.8,1082.5999999999999,1118.8,1090.9000000000001,185,154,194,201,196,28,18,13,6,13,19,10,10,20,10,12,26,24,14,7,4,17,10,12,17,9,13,8,19,14,11,15,16,16,12,16,19,18,22,20,15,13,16,20,15,11,16,22,8,20,18,19,23,23,12,14,14,30,10,10,11,11,20,16,25]
["Junee","n.c.","n.c.",0.84036423159999996,75,538.70000000000005,434.2,557.79999999999995,201.1,371.2,36,28,36,13,24,6,4,2,5,2,5,0,2,1,4,2,3,7,2,0,8,0,1,0,2,1,1,2,4,5,3,5,4,2,3,3,4,2,3,1,1,1,3,0,1,1,2,0,3,0,0,1,1,3,1,3,1,0,2,0,3,3,4,2,2]
["Kempsey","Stable",13.4,2.5338106829,9,709.4,802.2,840.1,946.1,1119.3,211,245,259,295,349,20,18,18,13,14,24,23,10,12,23,13,23,20,18,18,17,15,9,12,14,27,24,38,33,31,31,21,10,22,25,23,15,21,12,21,27,36,21,11,15,24,18,25,24,23,21,38,39,40,26,31,19,34,27,24,20,29,38,29,32]
["Kiama","Stable","Stable",0.30558990429999999,115,98.4,166.5,165.4,121.9,135,23,38,38,28,31,4,1,6,0,1,1,3,1,1,0,5,0,2,2,2,1,3,2,2,2,15,3,3,1,7,2,3,2,5,3,2,1,1,4,3,5,3,0,2,1,4,2,4,0,2,4,2,4,2,3,2,3,2,2,3,4,4,2,0,4]
["Ku-ring-gai","Stable","Stable",0.23335179189999999,118,81.8,119.7,117.9,102.3,103.1,104,151,147,127,128,10,8,4,8,9,8,13,10,10,7,14,3,9,7,20,9,23,10,13,6,10,13,23,8,15,6,13,16,19,19,9,8,8,10,14,10,9,10,12,7,11,8,16,12,14,8,12,8,7,11,10,19,4,10,7,8,18,13,14,7]
["Kyogle","Stable","Stable",0.88604731309999996,72,341.1,344.6,342.4,338.5,391.4,30,32,32,32,37,2,2,5,2,4,4,3,2,0,0,3,3,4,2,2,3,0,3,4,3,2,5,2,2,4,2,2,2,3,2,2,4,2,3,6,0,5,2,2,0,6,1,0,2,5,2,6,1,6,4,3,2,1,0,2,2,4,2,7,4]
["Lachlan","Stable","Stable",2.8393435162,5,1087.7,805.3,601.29999999999995,879.6,1254.3,67,50,37,54,77,6,4,2,3,3,9,6,8,10,7,3,6,3,3,2,5,4,4,4,6,8,3,3,5,4,2,3,3,0,3,4,1,4,3,4,6,3,7,7,3,6,2,6,2,5,9,2,2,2,8,4,2,8,4,9,6,7,11,10,6]
["Lake Macquarie","Stable","Stable",0.89879123930000004,71,393.9,353.1,381.2,377.2,397,811,747,816,817,860,77,61,66,67,42,68,68,56,80,71,70,85,76,49,67,59,59,51,43,58,58,67,77,83,79,65,75,69,64,57,66,59,41,79,84,78,75,80,87,68,57,51,52,56,58,77,77,79,83,61,70,65,72,66,62,75,58,69,83,96]
["Lane Cove","Stable",13.6,0.3389157324,113,89.7,157.5,90.9,172.2,149.69999999999999,36,63,36,69,60,9,2,1,4,4,2,2,3,0,1,5,3,9,5,3,6,7,5,1,6,9,2,3,7,3,0,1,3,5,3,4,4,5,3,4,1,7,9,4,9,3,5,4,6,7,3,5,7,9,7,2,3,5,3,4,5,5,11,1,5]
["Leeton","Stable","Stable",2.0554220314,16,900,722.9,871.1,785.8,908,103,83,100,90,104,5,8,5,13,5,9,12,6,12,8,8,12,7,8,4,9,9,6,6,7,4,8,9,6,14,5,11,10,5,7,10,4,10,8,8,8,12,5,13,5,8,2,6,6,10,11,6,6,11,10,7,7,7,7,9,7,8,9,11,11]
["Lismore","Stable","Stable",1.1145844034000001,57,432.6,483.8,626.70000000000005,472,492.4,189,214,278,209,218,17,17,16,10,16,15,15,15,18,10,22,18,27,6,8,11,17,17,9,22,30,18,28,21,26,29,21,15,35,23,19,13,23,17,24,33,21,9,18,27,17,13,18,10,15,21,22,18,19,24,25,14,22,13,12,11,25,18,12,23]
["Lithgow","Stable",13.9,2.0882928005000001,14,527.70000000000005,623,714.5,725.5,922.5,114,131,149,151,192,7,17,11,7,15,10,4,9,7,11,8,8,16,10,16,9,4,13,5,16,13,6,12,11,10,9,19,18,16,11,8,18,8,11,11,10,9,15,19,10,19,8,10,12,5,17,16,11,14,18,12,14,16,14,21,22,14,7,18,22]
["Liverpool",23.5,9.8000000000000007,1.2359383845,51,395.1,449.3,472.1,442.1,546,899,1037,1107,1060,1309,83,70,74,68,54,71,68,68,81,76,91,95,82,78,88,79,83,86,97,89,70,94,75,116,99,71,100,122,86,75,72,75,75,115,104,113,92,77,114,63,71,58,78,101,108,93,89,116,115,115,115,95,91,121,101,101,91,141,103,120]
["Liverpool Plains","Stable","Stable",1.8618154357000001,23,569.4,689.3,630.9,783.3,822.5,45,53,48,60,63,2,3,5,3,3,2,2,2,4,3,6,10,8,9,6,1,6,6,5,1,2,4,3,2,5,2,2,0,3,9,4,0,14,2,3,4,7,9,4,2,3,7,3,3,7,4,4,7,7,10,4,6,5,5,4,4,4,1,4,9]
["Lockhart","n.c.","n.c.",0.94042243569999995,69,365.3,212.1,270.39999999999998,148.4,415.4,12,7,9,5,14,1,0,1,0,0,0,3,1,1,5,0,0,0,0,2,0,0,0,2,0,1,1,0,1,0,0,1,0,1,1,4,0,1,0,0,1,0,2,0,0,0,2,1,0,0,0,0,0,1,0,0,2,2,1,0,1,2,3,2,0]
["Lord Howe Island","n.c.","n.c.",".","n.c.","      . ","      . ","      . ","      . ","      . ",1,0,18,1,9,0,0,0,0,0,0,0,1,0,0,0,0,0,0,0,0,0,0,0,0,0,0,0,0,0,0,0,0,0,18,0,0,0,0,0,0,0,0,0,0,0,0,0,0,0,0,0,1,0,2,0,0,0,0,0,1,0,6,0,0]
["Maitland","Stable",13.2,1.7144349091,31,507.3,494.7,496.6,656.9,757.3,432,434,450,615,709,43,47,31,35,14,36,29,37,31,45,38,46,47,41,47,28,37,23,35,31,41,36,27,41,35,35,47,24,47,30,27,51,43,38,32,41,38,55,37,53,61,69,41,49,46,46,62,58,82,54,48,60,45,50,65,65,49,57,49,85]
["Mid-Coast","Stable",6.6,1.4177856881999999,45,502,508.7,568,561.5,626.29999999999995,471,486,548,546,609,35,38,36,46,20,33,48,39,48,49,36,43,40,39,43,44,29,39,27,46,32,49,45,53,57,40,57,42,36,45,37,45,35,45,60,49,64,56,43,34,40,41,24,43,37,52,47,65,72,47,59,37,51,50,57,33,46,53,47,57]
["Mid-Western Regional","Stable","Stable",1.2198434955999999,52,657.5,622.6,626.1,628,538.9,166,159,161,162,139,19,13,20,12,15,11,18,14,10,13,13,8,19,26,15,13,13,10,3,8,17,6,12,17,10,13,10,15,13,17,10,14,12,12,15,20,9,16,13,10,14,16,17,13,7,10,14,23,18,12,13,12,11,5,16,14,2,7,16,13]
["Moree Plains",-17.600000000000001,7.9,4.3624627003000001,3,1380.1,1658.6,1913,2339,1927.1,183,216,248,301,248,14,17,20,17,6,12,8,13,19,10,19,28,13,16,17,10,12,25,11,18,16,16,27,35,28,25,21,16,22,14,16,27,13,19,18,29,27,27,31,26,26,23,12,26,19,30,29,25,22,17,22,15,23,21,17,24,23,23,19,22]
["Mosman","Stable","Stable",0.26563001069999997,116,93.7,67.8,87.8,92.5,117.3,29,20,25,26,33,2,2,4,5,2,3,4,2,1,0,1,3,3,0,0,4,0,3,1,2,3,1,3,0,0,1,6,5,5,1,0,1,1,0,2,3,2,4,4,1,2,1,2,2,1,3,2,2,3,3,0,3,4,4,2,3,2,7,1,1]
["Murray River",41.4,"n.c.",0.7130683551,85,288.8,151.4,297.2,222.8,315,35,19,38,29,41,4,2,2,1,2,3,6,1,2,1,5,6,4,1,1,1,1,2,1,0,3,3,1,1,5,3,3,0,1,3,3,4,3,5,4,4,2,1,1,2,2,2,0,3,8,2,3,3,2,3,4,7,1,2,5,3,5,4,3,2]
["Murrumbidgee","n.c.","n.c.",1.0791763749000001,59,536.1,635.4,252.5,616.9,476.7,21,23,9,22,17,2,4,3,1,0,2,1,0,3,1,1,3,10,0,1,1,1,2,3,2,0,2,0,1,0,0,1,0,2,3,0,1,1,1,0,0,1,3,1,4,1,1,2,1,2,1,0,5,1,2,5,0,2,0,0,2,3,1,0,1]
["Muswellbrook",49.6,14.3,2.8057127298000002,6,732.8,775.5,783.3,828.3,1239.4000000000001,120,128,129,137,205,6,9,11,7,6,6,10,7,12,11,11,24,10,9,10,15,7,12,7,13,12,9,10,14,8,15,6,9,13,15,7,11,7,16,10,12,11,14,8,8,12,9,9,10,11,18,16,11,19,19,16,9,17,12,22,19,15,22,20,15]
["Nambucca Valley",-28.2,"Stable",1.4827933288999999,41,570.6,676.6,897.9,912.2,655,113,137,183,188,135,5,8,8,9,10,6,3,12,4,10,23,15,17,9,8,4,13,4,8,7,9,17,16,25,17,15,7,13,17,16,10,14,12,10,19,33,20,10,14,11,14,14,16,20,26,11,16,16,24,10,16,12,9,5,21,6,8,9,7,8]
["Narrabri","Stable","Stable",1.8862943303999999,22,662.4,740.3,905.7,919.7,833.3,87,96,116,117,106,11,5,5,8,6,8,10,10,5,5,8,6,9,18,6,6,5,6,9,4,2,7,10,14,11,10,8,5,12,15,3,5,11,14,10,12,15,5,12,9,6,18,8,13,4,10,8,9,8,8,7,14,3,10,10,9,8,11,11,7]
["Narrandera","Stable",17,2.3741281057000001,11,542.6,952.4,889.6,821.5,1048.8,32,55,51,47,60,5,2,2,1,4,2,0,3,3,0,1,9,7,4,3,3,1,8,7,4,5,1,6,6,7,2,5,5,2,6,3,4,4,3,3,7,3,2,5,5,1,2,5,7,2,4,6,5,7,6,5,2,8,6,3,7,6,1,2,7]
["Narromine","Stable","Stable",2.5700213664999998,8,890.1,921.7,1287.2,995.3,1135.3,58,60,83,64,73,15,4,5,1,7,10,1,4,2,3,4,2,6,1,4,8,4,7,5,4,5,5,4,7,10,6,7,4,9,5,6,3,7,6,9,11,11,4,3,0,5,4,8,3,3,12,6,5,7,7,8,0,5,4,4,4,11,11,5,7]
["Newcastle","Stable",2.9,1.0491967861,61,428.9,396.1,397.8,466.4,463.5,710,665,674,800,795,63,57,67,56,48,48,54,68,56,62,68,63,58,41,53,46,58,57,47,53,45,59,78,70,49,53,43,58,54,66,49,47,65,47,57,86,70,61,86,61,78,60,72,64,44,78,56,70,85,82,74,68,65,71,62,59,42,57,70,60]
["North Sydney","Stable","Stable",0.32972822140000002,114,128.1,130.4,122.4,116.8,145.69999999999999,96,93,85,81,101,6,10,8,10,6,10,6,12,4,6,12,6,11,6,6,9,9,4,7,4,12,6,15,4,8,11,7,6,8,6,9,8,3,7,3,9,5,9,9,5,6,9,3,7,5,9,8,6,8,5,6,7,9,7,4,3,8,17,14,13]
["Northern Beaches","Stable",-13.2,0.23729378770000001,117,178.1,131.1,112.3,101.4,104.8,487,351,297,267,276,55,33,43,48,36,36,50,25,40,53,35,33,32,28,30,34,24,38,13,27,40,31,28,26,23,24,25,36,34,21,24,22,25,20,21,22,20,26,20,29,22,19,19,13,22,22,25,30,18,23,19,24,25,15,16,25,25,24,28,34]
["Oberon","n.c.","n.c.",0.56623612800000001,101,462,416.1,233.5,321.60000000000002,250.1,25,23,13,18,14,0,1,5,3,0,1,1,1,0,10,2,1,3,2,1,1,1,0,2,0,4,2,3,4,1,0,1,2,0,3,3,0,2,1,0,0,0,3,1,0,3,2,0,2,1,3,2,1,0,0,3,0,0,2,3,4,1,1,0,0]
["Orange",-33.4,"Stable",1.3748293263,46,742.1,607.4,726.9,912.1,607.29999999999995,315,263,318,401,267,35,33,18,32,20,15,28,21,23,28,39,23,43,24,25,14,14,17,16,29,20,21,24,16,26,27,30,35,36,18,29,26,23,24,20,24,39,22,27,32,38,28,45,43,23,46,24,34,25,22,36,14,26,24,18,24,14,22,23,19]
["Parkes","Stable",11.7,2.1616447159000001,13,593.20000000000005,670.2,802.7,864.3,954.9,88,98,116,124,137,12,7,10,5,2,8,9,6,6,9,7,7,7,11,10,6,5,6,7,8,7,5,14,12,9,9,8,13,11,11,6,10,7,12,13,7,10,7,8,12,13,9,12,7,7,12,15,12,12,17,8,12,9,8,12,13,10,16,11,9]
["Parramatta","Stable","Stable",0.70508219240000003,88,288.60000000000002,341.8,319.5,309.2,311.5,742,888,826,805,811,63,78,64,59,65,42,56,62,68,63,55,67,78,70,98,59,70,72,61,67,63,84,79,87,79,69,83,71,87,46,57,61,61,60,79,73,53,71,75,80,72,61,76,71,55,59,80,52,79,66,62,52,63,71,73,83,61,65,58,78]
["Penrith",20.8,"Stable",1.3219137297000001,48,625,639.29999999999995,509.9,483.5,584,1331,1384,1118,1068,1290,109,95,105,113,104,96,95,108,127,124,109,146,133,108,123,96,116,128,114,94,109,141,116,106,111,95,85,99,114,75,65,82,87,84,102,119,103,97,82,112,94,87,73,88,79,84,83,86,101,100,124,101,84,89,91,105,113,122,112,148]
["Port Macquarie-Hastings","Stable",10.3,1.1945269732999999,53,372.7,371.6,446.7,436,527.70000000000005,315,317,387,385,466,20,28,24,26,27,9,24,34,21,32,32,38,25,32,29,15,18,16,18,34,30,28,32,40,34,36,40,28,30,27,31,32,29,32,29,39,42,30,27,27,20,20,32,33,43,32,41,38,48,54,37,37,25,36,32,42,35,26,43,51]
["Port Stephens",15.9,4.8,1.3522392349000001,47,515.79999999999995,481.9,467.3,515.20000000000005,597.29999999999995,379,358,352,395,458,47,22,34,26,27,23,23,25,32,41,37,42,36,28,21,35,26,30,19,29,24,36,24,50,29,44,27,24,37,27,27,25,24,24,33,31,27,35,33,34,27,23,36,36,32,28,34,50,31,37,31,33,26,25,43,42,55,41,47,47]
["Queanbeyan-Palerang Regional",26.2,13.3,0.84934411730000003,73,239,306.2,290.2,297.39999999999998,375.2,146,191,184,191,241,17,5,8,6,2,11,19,10,16,13,18,21,16,10,15,12,18,22,8,17,18,18,22,15,11,19,13,15,13,10,11,18,15,19,21,19,14,13,7,11,17,11,23,23,25,17,17,13,18,17,16,20,30,18,13,16,31,26,19,17]
["Randwick",23.4,"Stable",0.71238978269999997,86,270.10000000000002,275.5,286.89999999999998,255,314.7,420,392,388,346,427,51,32,35,23,26,37,35,37,27,33,43,41,35,40,33,24,33,26,35,28,25,25,47,41,40,28,29,30,32,29,24,30,27,43,43,33,29,25,24,41,20,24,25,24,34,34,28,38,36,33,51,30,34,29,40,44,29,37,25,39]
["Richmond Valley","Stable","Stable",1.6809411956,32,618,645.5,606.1,683.5,742.6,145,152,143,162,176,17,14,12,4,20,5,25,11,4,3,10,20,10,13,5,8,6,10,14,13,17,16,20,20,16,12,8,7,11,15,8,6,15,12,15,18,15,8,16,15,20,6,19,19,11,13,8,12,9,16,14,13,15,8,15,19,13,23,13,18]
["Ryde","Stable",-5.8,0.40053204380000001,108,224.9,244.7,218.8,160.9,176.9,295,320,284,211,232,21,16,36,26,28,26,30,17,20,19,29,27,28,31,16,35,36,32,23,18,29,20,30,22,39,25,27,30,31,20,14,22,15,19,23,19,24,17,19,15,24,4,20,16,18,19,15,20,18,16,18,11,19,18,16,28,17,21,13,37]
["Shellharbour","Stable","Stable",0.70803009169999997,87,325,351.7,309.8,324.3,312.8,238,263,237,254,245,23,20,17,15,26,14,18,21,21,13,28,22,28,25,22,21,20,25,14,16,27,19,14,32,19,14,23,17,18,27,25,12,13,22,27,20,21,21,22,16,18,13,16,26,18,35,24,24,26,18,20,28,12,23,13,25,22,20,20,18]
["Shoalhaven","Stable","Stable",0.95207603220000003,68,370.1,433.6,413.6,427.9,420.6,391,464,449,469,461,52,30,38,26,24,26,28,14,35,36,43,39,52,43,38,30,34,37,31,46,41,37,41,34,57,38,38,41,28,39,35,35,28,40,29,41,59,27,42,32,38,27,33,39,43,50,36,43,39,41,49,39,26,33,39,33,39,41,29,53]
["Singleton","Stable","Stable",0.98332879780000004,65,379.4,392.5,364,434.4,434.4,89,96,90,109,109,8,8,1,7,15,4,5,9,9,6,6,11,3,7,7,4,6,6,10,9,7,8,12,17,4,8,11,6,9,8,6,7,5,3,8,15,17,11,17,6,1,6,8,15,8,8,7,5,8,10,10,12,7,7,8,9,6,8,9,15]
["Snowy Monaro Regional","Stable","Stable",0.79873206460000001,77,413.6,294.5,276.89999999999998,297.89999999999998,352.8,86,63,60,65,77,9,3,6,5,8,5,10,1,11,11,10,7,5,9,3,5,4,6,3,8,6,2,6,6,2,5,9,3,4,6,5,6,5,8,3,4,2,8,9,2,4,6,4,5,6,8,4,7,3,7,6,6,3,4,5,13,8,5,10,7]
["Snowy Valleys","Stable","Stable",0.81843520380000001,76,511.2,531.4,335.6,575.79999999999995,361.5,74,79,50,86,54,8,7,2,7,1,3,4,8,9,6,9,10,10,8,4,3,12,9,3,7,2,6,6,9,4,3,4,5,6,3,3,4,5,4,4,5,5,4,10,9,7,5,5,6,11,1,7,16,9,5,5,3,1,5,3,8,3,3,5,4]
["Strathfield","Stable","Stable",0.7345006972,80,300.7,291.5,269.8,305,324.5,141,135,124,141,150,13,15,11,7,7,11,14,6,11,17,15,14,20,10,13,15,11,13,12,5,8,8,10,10,19,12,11,11,6,7,6,3,12,12,14,11,9,15,15,10,14,5,14,10,5,13,14,17,11,13,9,10,19,15,13,9,14,9,12,16]
["Sutherland Shire",-15.1,"Stable",0.56925506910000001,100,298.39999999999998,284,291.8,296.3,251.5,688,653,674,687,583,71,64,55,67,42,49,55,49,46,51,79,60,67,54,72,45,52,40,46,51,40,67,71,48,74,51,65,53,52,57,62,53,53,46,55,53,77,55,72,54,47,59,51,44,59,38,57,74,45,45,69,56,45,47,50,46,42,37,52,49]
["Sydney","Stable","Stable",1.2144034938999999,"n.c.",451.7,490.8,472.3,555.29999999999995,536.5,1111,1114,1014,1211,1170,88,118,102,91,81,106,79,90,95,87,74,100,106,97,97,86,79,84,84,85,83,106,100,107,81,110,74,90,87,90,81,58,71,84,84,104,109,87,121,91,89,89,107,112,99,99,105,103,104,98,123,96,80,80,105,112,84,92,88,108]
["Tamworth Regional","Stable","Stable",1.7858081813,26,657.3,655.7,637.70000000000005,691.2,788.9,411,415,406,446,509,39,32,32,29,26,26,44,25,36,34,47,41,39,29,22,32,42,41,24,30,37,44,27,48,41,20,47,48,39,35,26,29,24,40,28,29,37,42,47,39,37,22,42,39,39,27,36,39,39,44,45,35,26,34,54,31,30,44,49,78]
["Temora","n.c.","n.c.",1.0571126112,60,444,412.1,266.10000000000002,216.8,467,28,25,16,13,28,0,3,2,4,0,2,1,3,10,3,0,0,5,1,1,2,1,1,2,3,2,2,4,1,2,3,2,1,3,0,2,1,0,2,0,0,1,1,2,0,1,0,1,2,1,1,2,1,1,1,16,1,4,0,0,1,0,2,1,1]
["Tenterfield","Stable","Stable",1.8428397199,25,834.1,960.7,985.3,654.20000000000005,814.1,55,65,67,45,56,6,9,12,11,1,6,4,0,2,1,3,0,6,2,4,2,13,6,4,10,6,5,6,1,7,10,9,6,5,7,1,4,5,7,1,5,4,2,2,2,5,5,3,5,2,1,9,5,8,6,3,3,1,1,10,10,4,1,6,3]
["The Hills Shire","Stable","Stable",0.35902664220000002,110,168,178.8,173.9,163.1,158.6,299,333,335,325,316,21,15,25,24,27,27,25,14,29,19,30,43,39,24,43,17,30,34,23,22,22,23,29,27,28,31,35,30,35,37,15,23,20,28,21,32,26,31,24,25,30,23,22,31,35,27,25,26,34,31,30,20,25,33,19,32,27,24,24,17]
["Tweed",-23.8,"Stable",0.73247943140000005,81,348.5,350.8,371.3,424.6,323.60000000000002,338,339,361,416,317,47,37,33,22,24,18,23,20,37,20,24,33,29,13,34,18,28,29,27,26,31,29,39,36,43,27,29,24,25,29,25,31,24,27,35,42,37,49,37,28,29,26,28,38,35,33,28,48,30,31,23,35,19,33,22,22,28,19,24,31]
["Unincorporated Far West","n.c.","n.c.",".","n.c.","      . ","      . ","      . ","      . ","      . ",3,4,1,3,4,0,0,0,0,0,1,1,0,0,0,0,1,3,0,0,0,0,0,1,0,0,0,0,0,0,1,0,0,0,0,0,0,0,0,0,0,0,0,0,1,0,0,0,0,0,0,2,0,0,0,1,0,0,0,0,1,0,1,1,0]
["Upper Hunter Shire","Stable","Stable",0.98195851970000003,66,303.3,539.6,469.9,482.8,433.8,43,77,67,69,62,9,2,4,2,1,6,0,3,5,2,3,6,8,2,9,8,7,9,13,2,5,2,8,4,10,14,4,2,7,4,7,3,1,2,5,8,7,5,5,4,10,5,5,12,3,1,1,11,2,6,1,2,7,8,11,5,4,4,6,6]
["Upper Lachlan Shire","n.c.","n.c.",0.45004595400000003,107,99.3,107.7,153,210.5,198.8,8,9,13,18,17,2,2,0,0,0,0,0,0,0,0,1,3,0,0,0,2,0,0,1,0,0,2,2,2,0,1,3,2,1,0,1,1,1,1,2,0,1,0,0,2,2,2,0,1,0,2,6,2,2,2,2,1,1,2,1,1,2,2,0,1]
["Uralla","n.c.","n.c.",0.71864480909999995,84,266.2,314.2,350.5,334.2,317.5,16,19,21,20,19,2,0,1,1,2,4,0,2,2,0,0,2,5,1,0,1,0,3,1,0,0,3,1,4,0,0,1,0,2,0,2,3,3,5,2,3,3,2,0,2,0,1,5,3,1,0,3,0,3,5,2,2,0,2,0,0,0,2,3,0]
["Wagga Wagga","Stable","Stable",1.6331115741,35,789.3,682.1,677.6,752.2,721.4,515,458,460,514,493,50,35,42,42,44,42,25,55,22,49,52,57,43,38,31,38,42,44,40,39,35,47,31,30,38,23,47,43,35,46,46,24,38,37,33,50,39,26,54,35,38,34,37,44,65,42,45,55,58,44,39,42,27,43,29,48,27,50,53,33]
["Walcha","n.c.","n.c.",1.4289332832999999,43,287.2,491.6,496.9,764.1,631.20000000000005,9,15,15,23,19,2,0,0,0,1,1,1,0,3,1,0,0,1,1,2,0,0,1,0,2,0,5,1,2,0,1,0,1,0,1,0,5,1,0,1,5,4,0,3,0,0,3,2,0,1,2,4,4,4,0,3,1,0,1,2,2,4,0,2,0]
["Walgett",21.2,7.5,8.2078721856999994,1,2520.1999999999998,2529.4,2362.1999999999998,2991.3,3625.8,150,144,132,165,200,14,12,13,5,9,17,9,9,14,13,16,19,18,4,14,15,14,10,9,8,7,10,16,19,16,11,5,16,19,8,11,10,8,9,5,14,5,13,5,8,19,12,14,17,21,9,19,23,22,12,18,18,8,18,15,14,16,15,24,20]
["Warren",47.2,"Stable",".","n.c.","      . ","      . ","      . ","      . ","      . ",40,39,38,36,53,5,5,2,4,3,0,1,3,3,2,9,3,5,6,2,2,6,2,6,1,4,1,2,2,4,4,1,5,0,5,5,1,3,2,4,4,5,0,4,0,8,1,1,6,1,6,2,2,3,1,1,0,4,5,3,6,4,6,10,10]
["Warrumbungle Shire","Stable",11.9,1.7628016733,28,495.8,353.3,561.79999999999995,908.5,778.7,46,33,52,84,72,4,7,6,4,2,4,4,4,2,1,5,3,4,3,4,2,3,4,1,2,2,3,2,3,4,9,6,1,2,2,4,0,1,3,6,14,11,2,6,6,4,3,2,7,9,13,7,14,11,7,8,1,6,7,6,2,9,4,7,4]
["Waverley","Stable","Stable",0.66288359470000002,94,264.10000000000002,239.7,273.8,251,292.8,196,172,190,174,203,23,12,7,27,12,7,13,18,10,9,26,32,16,16,14,16,13,9,17,6,19,9,24,13,12,14,13,15,12,23,16,15,19,18,13,20,8,15,19,8,14,15,12,12,17,25,15,14,23,17,14,20,9,11,20,22,24,14,17,12]
["Weddin","n.c.","n.c.",0.50110263389999998,105,276.8,387.7,417.6,193.7,221.4,10,14,15,7,8,2,0,0,2,0,1,1,1,0,1,2,0,2,1,0,1,1,1,3,1,0,2,1,1,2,2,0,1,0,3,0,2,3,0,2,0,4,0,0,1,1,0,0,1,0,0,0,0,0,0,1,0,1,0,0,1,0,1,2,2]
["Wentworth","Stable","Stable",1.9368503972,19,1020.8,908.6,1001.3,1026.7,855.6,72,67,75,78,65,10,3,4,7,5,7,4,12,3,3,6,8,7,9,7,3,5,6,6,6,6,2,5,5,11,5,4,3,8,4,5,8,5,3,9,10,15,3,6,4,6,1,5,11,7,6,10,4,6,11,6,3,2,7,8,3,8,2,5,4]
["Willoughby","Stable","Stable",0.36892522,109,119.6,121.1,121,140.4,163,97,95,92,106,123,12,9,6,7,7,11,12,6,11,6,6,4,7,9,15,2,11,4,9,9,6,5,10,8,6,4,4,10,8,6,8,9,7,9,13,8,11,12,7,8,11,8,10,12,9,7,6,5,7,13,8,7,13,14,8,12,12,5,11,13]
["Wingecarribee","Stable","Stable",0.54025973059999999,103,195.6,210,234.3,214,238.7,100,109,123,113,126,11,11,9,6,9,6,5,4,10,6,10,13,11,6,8,12,10,12,7,10,7,4,11,11,10,12,4,11,15,5,15,13,5,16,8,9,12,7,11,5,6,8,8,7,15,11,10,13,11,14,18,4,8,16,12,14,4,6,14,5]
["Wollondilly","Stable","Stable",0.75456352699999996,79,310.5,338.2,269.39999999999998,302.89999999999998,333.3,165,181,146,169,186,16,17,11,16,13,8,11,11,13,16,14,19,22,18,15,8,12,12,16,22,13,14,14,15,16,15,4,13,11,14,11,10,12,21,10,9,18,18,12,17,16,16,13,12,16,5,15,11,11,16,15,12,13,9,17,25,15,13,17,23]
["Wollongong","Stable","Stable",0.73215565429999996,82,315.89999999999998,308.8,303.7,303.60000000000002,323.39999999999998,689,663,652,657,700,69,66,48,60,68,51,53,46,46,48,57,77,47,60,66,51,42,54,60,43,75,52,52,61,92,48,56,63,49,52,45,47,38,54,52,56,57,57,45,51,65,61,56,45,44,52,63,61,59,55,63,44,53,47,68,58,54,55,64,80]
["Woollahra","Stable",9.8000000000000007,0.58386113169999998,98,160.1,146.80000000000001,189.2,218.7,257.89999999999998,95,82,102,117,138,5,5,11,5,6,6,16,7,8,12,5,9,8,7,7,4,5,8,9,3,6,7,15,3,7,6,7,5,3,7,12,11,16,12,8,8,10,3,11,7,8,20,8,9,7,9,16,9,11,20,6,15,16,3,10,6,13,15,12,11]
["Yass Valley","Stable",9,0.53405246039999998,104,169.7,170,208.8,293.5,235.9,29,29,36,51,41,3,0,3,2,0,3,2,3,2,5,3,3,1,0,8,0,1,2,1,2,2,6,1,5,1,3,1,4,4,2,2,6,3,2,2,6,1,2,2,5,3,2,3,8,7,4,12,2,3,3,4,3,2,2,3,9,0,6,3,3]
["In Custody","n.c.","n.c.",".","n.c.","      . ","      . ","      . ","      . ","      . ",7,5,6,4,11,0,0,0,2,1,0,0,0,0,0,3,1,0,0,0,0,0,1,0,2,1,0,1,0,1,0,1,0,1,0,1,1,1,0,0,0,1,1,0,0,0,0,0,0,1,1,0,0,0,0,1,0,0,0,1,2,1,0,4,2]
["NSW",6.7,3.6,1,"n.c.",387.6,398.8,396.8,413.9,441.7,31349,32280,32132,33797,36072,3073,2551,2637,2439,2295,2351,2363,2502,2528,2676,2779,3155,3160,2577,2807,2253,2455,2633,2313,2591,2619,2794,2914,3164,3030,2661,2751,2695,2749,2664,2407,2306,2290,2626,2839,3114,3015,2690,2947,2604,2666,2451,2696,2886,2800,2926,2932,3184,3207,3040,3186,2701,2618,2830,2923,3005,2910,3034,3089,3529]
[]
["Notes:"]
["*NSW Police flag whether criminal incidents that they record on their COPS (Computerised Operational Policing System) database are domestic violence-related. New South Wales police define domestic assault in line with the Crimes (Domestic and Personal Violence) Act 2007. Under this legislation a person has a domestic relationship with another if they are a spouse/partner, ex spouse/ex partner, boy/girlfriend (including ex), parent/guardian (including step/foster), child (including step/foster), sibling, other member of family (including kin), is living or has lived in the same household as other person, is dependant on the paid or unpaid care of the other person, or are involved in a \"love triangle\" (e.g. a woman’s ex-partner and current partner would have a domestic relationship with each other for the purposes of this Act even if they had never met). "]
[]
["^BOCSAR relies upon the Kendall Rank Order Correlation statistical test (or Kendall's tau-b) to determine whether a series is trending upwards, downwards or is stable (p<.05).  The statistical test is applied to the monthly count data over the specified period. Where a significant trend is found, the average annual percentage change over the time period is reported. If any of the 12-monthly totals in the series have a value of less than 20, a trend test is not conducted. When this occurs, the relevant cell will be left blank or contain 'n.c.' (not calculated).  Significant upward tends are in red and significant downward trends are in yellow."]
["~The ratio to NSW rate statistics are a comparison of a NSW regional rate per 100,000 population to the  NSW rate per 100,000 population. A ratio of one indicates parity with the NSW rate. Ratios indicating double the NSW rate (or more) before rounding are highlighted in red, whilst ratios indicating half the NSW rate (or less) before rounding are highlighted in yellow. Ratios are not calculated for regions with a population of less than 3,000. "]
[]
["^^ Ranks are only calculated for LGAs with populations greater than 3,000."]
[]
["^ LGAs with populations lower than 3,000 are excluded from rate calculations (indicated by 'n.c.') because rate calculations for these areas are very sensitive to small changes in population sizes and the number of incidents recorded. Rate calculations should also be treated very cautiously for LGAs that have high visitor numbers relative to their residential population. This is because rate calculations are based on estimated residential population and no adjustment has been made for the number of people visiting each LGA per year. For the rate calculations, specialised population data were prepared and provided to BOCSAR by the Australian Bureau of Statistics."]
[]
["Source: NSW Bureau of Crime Statistics and Research"]
["Please retain this reference number for future correspondence."]
["NOTE: Data sourced from the NSW Bureau of Crime Statistics and Research must be acknowledged in any document (electronic or otherwise) containing that data."]
["The acknowledgement should take the form of 'Source: NSW Bureau of Crime Statistics and Research'."]

{"sheet":"Graph NSW SA4 24 months","index":2,"n_rows":31,"n_cols":11,"rows_kept":31,"cut":false,"hidden":false,"merged":[]}
[{"$f":"'Working SA4'!C8","v":"NSW Recorded Crime Statistics, January 2022 to December 2023"}]
[{"$f":"'Working SA4'!$C$9","v":"Domestic violence related assault - Greater Sydney Statistical Area, NSW"}]
[]
[null,"24-month trend:",{"$f":"'Working SA4'!C6","v":6},null,"Ratio to NSW:",{"$f":"'Working SA4'!D2","v":0.81490694429999999},null,null,null,{"$f":"'Working SA4'!M1","v":"January 2022 - December 2022"},{"$f":"'Working SA4'!N1","v":"January 2023 - December 2023"}]
[null,null,null,null,null,null,null,null,{"$f":"'Working SA4'!$C$10","v":"Number of reported incidents"},{"$f":"'Working SA4'!M2","v":18015},{"$f":"'Working SA4'!N2","v":19089}]
[]
[]
[]
[]
[]
[]
[]
[]
[]
[]
[]
[]
[]
[]
[]
[]
[]
[]
[]
[]
[]
[]
[]
[]
[]
["Source: NSW Bureau of Crime Statistics and Research"]

{"sheet":"Graph LGA 24 months","index":3,"n_rows":31,"n_cols":11,"rows_kept":31,"cut":false,"hidden":false,"merged":[]}
[{"$f":"'Working LGA'!C8","v":"NSW Recorded Crime Statistics, January 2022 to December 2023"}]
[{"$f":"'Working LGA'!$C$9","v":"Domestic violence related assault - Albury Local Government Area, NSW"}]
[]
[null,"24-month trend:",{"$f":"'Working LGA'!C6","v":"Not significant"},null,"Ratio to NSW:",{"$f":"'Working LGA'!D2","v":1.6698542692},null,null,null,{"$f":"'Working LGA'!N1","v":"January 2022 - December 2022"},{"$f":"'Working LGA'!O1","v":"January 2023 - December 2023"}]
[null,null,null,null,null,null,null,null,{"$f":"'Working LGA'!$C$10","v":"Number of reported incidents"},{"$f":"'Working LGA'!N2","v":408},{"$f":"'Working LGA'!O2","v":418}]
[]
[]
[]
[]
[]
[]
[]
[]
[]
[]
[]
[]
[]
[]
[]
[]
[]
[]
[]
[]
[]
[]
[]
[]
[]
["Source: NSW Bureau of Crime Statistics and Research"]

{"sheet":"Graph NSW SA4 60 months","index":4,"n_rows":31,"n_cols":13,"rows_kept":31,"cut":false,"hidden":false,"merged":[]}
[{"$f":"'Working SA4'!C16","v":"NSW Recorded Crime Statistics, January 2019 to December 2023"}]
[{"$f":"'Working SA4'!$C$9","v":"Domestic violence related assault - Greater Sydney Statistical Area, NSW"}]
[]
[null,"60-month trend:",{"$f":"'Working SA4'!C14","v":2},null,"Ratio to NSW:",{"$f":"'Working SA4'!D2","v":0.81490694429999999},null,null,{"$f":"'Working SA4'!J1","v":"January 2019 - December 2019"},{"$f":"'Working SA4'!K1","v":"January 2020 - December 2020"},{"$f":"'Working SA4'!L1","v":"January 2021 - December 2021"},{"$f":"'Working SA4'!M1","v":"January 2022 - December 2022"},{"$f":"'Working SA4'!N1","v":"January 2023 - December 2023"}]
[null,null,null,null,null,null,null,{"$f":"'Working SA4'!$C$18","v":"Number of reported incidents"},{"$f":"'Working SA4'!J2","v":17654},{"$f":"'Working SA4'!K2","v":18196},{"$f":"'Working SA4'!L2","v":17357},{"$f":"'Working SA4'!M2","v":18015},{"$f":"'Working SA4'!N2","v":19089}]
[]
[]
[]
[]
[]
[]
[]
[]
[]
[]
[]
[]
[]
[]
[]
[]
[]
[]
[]
[]
[]
[]
[]
[]
[]
["Source: NSW Bureau of Crime Statistics and Research"]

{"sheet":"Graph LGA 60 months","index":5,"n_rows":31,"n_cols":13,"rows_kept":31,"cut":false,"hidden":false,"merged":[]}
[{"$f":"'Working LGA'!C16","v":"NSW Recorded Crime Statistics, January 2019 to December 2023"}]
[{"$f":"'Working LGA'!$C$9","v":"Domestic violence related assault - Albury Local Government Area, NSW"}]
[]
[null,"60-month trend:",{"$f":"'Working LGA'!C14","v":8.9},null,"Ratio to NSW:",{"$f":"'Working LGA'!D2","v":1.6698542692},null,null,{"$f":"'Working LGA'!K1","v":"January 2019 - December 2019"},{"$f":"'Working LGA'!L1","v":"January 2020 - December 2020"},{"$f":"'Working LGA'!M1","v":"January 2021 - December 2021"},{"$f":"'Working LGA'!N1","v":"January 2022 - December 2022"},{"$f":"'Working LGA'!O1","v":"January 2023 - December 2023"}]
[null,null,null,null,null,null,null,{"$f":"'Working LGA'!$C$10","v":"Number of reported incidents"},{"$f":"'Working LGA'!K2","v":297},{"$f":"'Working LGA'!L2","v":328},{"$f":"'Working LGA'!M2","v":405},{"$f":"'Working LGA'!N2","v":408},{"$f":"'Working LGA'!O2","v":418}]
[]
[]
[]
[]
[]
[]
[]
[]
[]
[]
[]
[]
[]
[]
[]
[]
[]
[]
[]
[]
[]
[]
[]
[]
[]
["Source: NSW Bureau of Crime Statistics and Research"]

{"sheet":"Working SA4","index":6,"n_rows":18,"n_cols":74,"rows_kept":18,"cut":false,"hidden":true,"merged":[]}
[{"$f":"'Table 1 SA4'!A7","v":"NSW Statistical Area"},{"$f":"'Table 1 SA4'!B7","v":"Two year trend (%)"},{"$f":"'Table 1 SA4'!C7","v":"Five year trend (annual average % change)"},{"$f":"'Table 1 SA4'!D7","v":"Ratio to NSW"},{"$f":"'Table 1 SA4'!E7","v":"January 2019 - December 2019"},{"$f":"'Table 1 SA4'!F7","v":"January 2020 - December 2020"},{"$f":"'Table 1 SA4'!G7","v":"January 2021 - December 2021"},{"$f":"'Table 1 SA4'!H7","v":"January 2022 - December 2022"},{"$f":"'Table 1 SA4'!I7","v":"January 2023 - December 2023"},{"$f":"'Table 1 SA4'!J7","v":"January 2019 - December 2019"},{"$f":"'Table 1 SA4'!K7","v":"January 2020 - December 2020"},{"$f":"'Table 1 SA4'!L7","v":"January 2021 - December 2021"},{"$f":"'Table 1 SA4'!M7","v":"January 2022 - December 2022"},{"$f":"'Table 1 SA4'!N7","v":"January 2023 - December 2023"},{"$f":"'Table 1 SA4'!O7","v":"2019-01-01"},{"$f":"'Table 1 SA4'!P7","v":"2019-02-01"},{"$f":"'Table 1 SA4'!Q7","v":"2019-03-01"},{"$f":"'Table 1 SA4'!R7","v":"2019-04-01"},{"$f":"'Table 1 SA4'!S7","v":"2019-05-01"},{"$f":"'Table 1 SA4'!T7","v":"2019-06-01"},{"$f":"'Table 1 SA4'!U7","v":"2019-07-01"},{"$f":"'Table 1 SA4'!V7","v":"2019-08-01"},{"$f":"'Table 1 SA4'!W7","v":"2019-09-01"},{"$f":"'Table 1 SA4'!X7","v":"2019-10-01"},{"$f":"'Table 1 SA4'!Y7","v":"2019-11-01"},{"$f":"'Table 1 SA4'!Z7","v":"2019-12-01"},{"$f":"'Table 1 SA4'!AA7","v":"2020-01-01"},{"$f":"'Table 1 SA4'!AB7","v":"2020-02-01"},{"$f":"'Table 1 SA4'!AC7","v":"2020-03-01"},{"$f":"'Table 1 SA4'!AD7","v":"2020-04-01"},{"$f":"'Table 1 SA4'!AE7","v":"2020-05-01"},{"$f":"'Table 1 SA4'!AF7","v":"2020-06-01"},{"$f":"'Table 1 SA4'!AG7","v":"2020-07-01"},{"$f":"'Table 1 SA4'!AH7","v":"2020-08-01"},{"$f":"'Table 1 SA4'!AI7","v":"2020-09-01"},{"$f":"'Table 1 SA4'!AJ7","v":"2020-10-01"},{"$f":"'Table 1 SA4'!AK7","v":"2020-11-01"},{"$f":"'Table 1 SA4'!AL7","v":"2020-12-01"},{"$f":"'Table 1 SA4'!AM7","v":"2021-01-01"},{"$f":"'Table 1 SA4'!AN7","v":"2021-02-01"},{"$f":"'Table 1 SA4'!AO7","v":"2021-03-01"},{"$f":"'Table 1 SA4'!AP7","v":"2021-04-01"},{"$f":"'Table 1 SA4'!AQ7","v":"2021-05-01"},{"$f":"'Table 1 SA4'!AR7","v":"2021-06-01"},{"$f":"'Table 1 SA4'!AS7","v":"2021-07-01"},{"$f":"'Table 1 SA4'!AT7","v":"2021-08-01"},{"$f":"'Table 1 SA4'!AU7","v":"2021-09-01"},{"$f":"'Table 1 SA4'!AV7","v":"2021-10-01"},{"$f":"'Table 1 SA4'!AW7","v":"2021-11-01"},{"$f":"'Table 1 SA4'!AX7","v":"2021-12-01"},{"$f":"'Table 1 SA4'!AY7","v":"2022-01-01"},{"$f":"'Table 1 SA4'!AZ7","v":"2022-02-01"},{"$f":"'Table 1 SA4'!BA7","v":"2022-03-01"},{"$f":"'Table 1 SA4'!BB7","v":"2022-04-01"},{"$f":"'Table 1 SA4'!BC7","v":"2022-05-01"},{"$f":"'Table 1 SA4'!BD7","v":"2022-06-01"},{"$f":"'Table 1 SA4'!BE7","v":"2022-07-01"},{"$f":"'Table 1 SA4'!BF7","v":"2022-08-01"},{"$f":"'Table 1 SA4'!BG7","v":"2022-09-01"},{"$f":"'Table 1 SA4'!BH7","v":"2022-10-01"},{"$f":"'Table 1 SA4'!BI7","v":"2022-11-01"},{"$f":"'Table 1 SA4'!BJ7","v":"2022-12-01"},{"$f":"'Table 1 SA4'!BK7","v":"2023-01-01"},{"$f":"'Table 1 SA4'!BL7","v":"2023-02-01"},{"$f":"'Table 1 SA4'!BM7","v":"2023-03-01"},{"$f":"'Table 1 SA4'!BN7","v":"2023-04-01"},{"$f":"'Table 1 SA4'!BO7","v":"2023-05-01"},{"$f":"'Table 1 SA4'!BP7","v":"2023-06-01"},{"$f":"'Table 1 SA4'!BQ7","v":"2023-07-01"},{"$f":"'Table 1 SA4'!BR7","v":"2023-08-01"},{"$f":"'Table 1 SA4'!BS7","v":"2023-09-01"},{"$f":"'Table 1 SA4'!BT7","v":"2023-10-01"},{"$f":"'Table 1 SA4'!BU7","v":"2023-11-01"},{"$f":"'Table 1 SA4'!BV7","v":"2023-12-01"}]
["Greater Sydney",6,2,0.81490694429999999,332.5,344.3,329.9,339.7,360,17654,18196,17357,18015,19089,1709,1438,1493,1406,1328,1332,1366,1419,1427,1511,1509,1716,1778,1452,1625,1304,1391,1534,1378,1423,1429,1581,1616,1685,1571,1437,1516,1538,1518,1393,1297,1198,1229,1449,1589,1622,1534,1395,1618,1465,1422,1337,1483,1568,1482,1516,1534,1661,1637,1623,1711,1449,1368,1523,1520,1562,1578,1633,1601,1884]
[]
[null,"start month:",{"$f":"AY1","v":"2022-01-01"}]
[null,"end month:",{"$f":"BV1","v":"2023-12-01"}]
[null,"% change:",{"$f":"IF(ISNUMBER(B2),B2,\"Not significant\")","v":6}]
[]
[null,"first title for Graph NSW SA4:",{"$f":"\"NSW Recorded Crime Statistics, \"&TEXT($C$4,\"mmmm yyyy\")&\" to \"&TEXT($C$5,\"mmmm yyyy\")","v":"NSW Recorded Crime Statistics, January 2022 to December 2023"}]
[null,"second title for Graph NSW SA4:",{"$f":"IF(OR(A2=\"NSW\", A2=\"Regional NSW\"), \"Domestic violence related assault - \" & A2, \"Domestic violence related assault - \" & A2 & \" Statistical Area, NSW\")","v":"Domestic violence related assault - Greater Sydney Statistical Area, NSW"}]
[null,"axis text:","Number of reported incidents"]
[]
[null,"start month:",{"$f":"O1","v":"2019-01-01"}]
[null,"end month:",{"$f":"BV1","v":"2023-12-01"}]
[null,"% change:",{"$f":"IF(ISNUMBER(C2),C2,\"Not significant\")","v":2}]
[]
[null,"first title for Graph NSW SA4:",{"$f":"\"NSW Recorded Crime Statistics, \"&TEXT($C$12,\"mmmm yyyy\")&\" to \"&TEXT($C$13,\"mmmm yyyy\")","v":"NSW Recorded Crime Statistics, January 2019 to December 2023"}]
[null,"second title for Graph NSW SA4:",{"$f":"IF(OR(A2=\"NSW\",A2=\"Regional NSW\"), \"Domestic violence related assault - \" & A2, \"Domestic violence related assault - \" & A2 & \" Statistical Area, NSW\")","v":"Domestic violence related assault - Greater Sydney Statistical Area, NSW"}]
[null,"axis text:","Number of reported incidents"]

{"sheet":"Working LGA","index":7,"n_rows":18,"n_cols":75,"rows_kept":18,"cut":false,"hidden":true,"merged":[]}
[{"$f":"'Table 2 LGA'!A7","v":"NSW Local Government Area"},{"$f":"'Table 2 LGA'!B7","v":"Two year trend (%)"},{"$f":"'Table 2 LGA'!C7","v":"Five year trend (annual average % change)"},{"$f":"'Table 2 LGA'!D7","v":"Ratio to NSW"},{"$f":"'Table 2 LGA'!E7","v":"Rank"},{"$f":"'Table 2 LGA'!F7","v":"January 2019 - December 2019"},{"$f":"'Table 2 LGA'!G7","v":"January 2020 - December 2020"},{"$f":"'Table 2 LGA'!H7","v":"January 2021 - December 2021"},{"$f":"'Table 2 LGA'!I7","v":"January 2022 - December 2022"},{"$f":"'Table 2 LGA'!J7","v":"January 2023 - December 2023"},{"$f":"'Table 2 LGA'!K7","v":"January 2019 - December 2019"},{"$f":"'Table 2 LGA'!L7","v":"January 2020 - December 2020"},{"$f":"'Table 2 LGA'!M7","v":"January 2021 - December 2021"},{"$f":"'Table 2 LGA'!N7","v":"January 2022 - December 2022"},{"$f":"'Table 2 LGA'!O7","v":"January 2023 - December 2023"},{"$f":"'Table 2 LGA'!P7","v":"2019-01-01"},{"$f":"'Table 2 LGA'!Q7","v":"2019-02-01"},{"$f":"'Table 2 LGA'!R7","v":"2019-03-01"},{"$f":"'Table 2 LGA'!S7","v":"2019-04-01"},{"$f":"'Table 2 LGA'!T7","v":"2019-05-01"},{"$f":"'Table 2 LGA'!U7","v":"2019-06-01"},{"$f":"'Table 2 LGA'!V7","v":"2019-07-01"},{"$f":"'Table 2 LGA'!W7","v":"2019-08-01"},{"$f":"'Table 2 LGA'!X7","v":"2019-09-01"},{"$f":"'Table 2 LGA'!Y7","v":"2019-10-01"},{"$f":"'Table 2 LGA'!Z7","v":"2019-11-01"},{"$f":"'Table 2 LGA'!AA7","v":"2019-12-01"},{"$f":"'Table 2 LGA'!AB7","v":"2020-01-01"},{"$f":"'Table 2 LGA'!AC7","v":"2020-02-01"},{"$f":"'Table 2 LGA'!AD7","v":"2020-03-01"},{"$f":"'Table 2 LGA'!AE7","v":"2020-04-01"},{"$f":"'Table 2 LGA'!AF7","v":"2020-05-01"},{"$f":"'Table 2 LGA'!AG7","v":"2020-06-01"},{"$f":"'Table 2 LGA'!AH7","v":"2020-07-01"},{"$f":"'Table 2 LGA'!AI7","v":"2020-08-01"},{"$f":"'Table 2 LGA'!AJ7","v":"2020-09-01"},{"$f":"'Table 2 LGA'!AK7","v":"2020-10-01"},{"$f":"'Table 2 LGA'!AL7","v":"2020-11-01"},{"$f":"'Table 2 LGA'!AM7","v":"2020-12-01"},{"$f":"'Table 2 LGA'!AN7","v":"2021-01-01"},{"$f":"'Table 2 LGA'!AO7","v":"2021-02-01"},{"$f":"'Table 2 LGA'!AP7","v":"2021-03-01"},{"$f":"'Table 2 LGA'!AQ7","v":"2021-04-01"},{"$f":"'Table 2 LGA'!AR7","v":"2021-05-01"},{"$f":"'Table 2 LGA'!AS7","v":"2021-06-01"},{"$f":"'Table 2 LGA'!AT7","v":"2021-07-01"},{"$f":"'Table 2 LGA'!AU7","v":"2021-08-01"},{"$f":"'Table 2 LGA'!AV7","v":"2021-09-01"},{"$f":"'Table 2 LGA'!AW7","v":"2021-10-01"},{"$f":"'Table 2 LGA'!AX7","v":"2021-11-01"},{"$f":"'Table 2 LGA'!AY7","v":"2021-12-01"},{"$f":"'Table 2 LGA'!AZ7","v":"2022-01-01"},{"$f":"'Table 2 LGA'!BA7","v":"2022-02-01"},{"$f":"'Table 2 LGA'!BB7","v":"2022-03-01"},{"$f":"'Table 2 LGA'!BC7","v":"2022-04-01"},{"$f":"'Table 2 LGA'!BD7","v":"2022-05-01"},{"$f":"'Table 2 LGA'!BE7","v":"2022-06-01"},{"$f":"'Table 2 LGA'!BF7","v":"2022-07-01"},{"$f":"'Table 2 LGA'!BG7","v":"2022-08-01"},{"$f":"'Table 2 LGA'!BH7","v":"2022-09-01"},{"$f":"'Table 2 LGA'!BI7","v":"2022-10-01"},{"$f":"'Table 2 LGA'!BJ7","v":"2022-11-01"},{"$f":"'Table 2 LGA'!BK7","v":"2022-12-01"},{"$f":"'Table 2 LGA'!BL7","v":"2023-01-01"},{"$f":"'Table 2 LGA'!BM7","v":"2023-02-01"},{"$f":"'Table 2 LGA'!BN7","v":"2023-03-01"},{"$f":"'Table 2 LGA'!BO7","v":"2023-04-01"},{"$f":"'Table 2 LGA'!BP7","v":"2023-05-01"},{"$f":"'Table 2 LGA'!BQ7","v":"2023-06-01"},{"$f":"'Table 2 LGA'!BR7","v":"2023-07-01"},{"$f":"'Table 2 LGA'!BS7","v":"2023-08-01"},{"$f":"'Table 2 LGA'!BT7","v":"2023-09-01"},{"$f":"'Table 2 LGA'!BU7","v":"2023-10-01"},{"$f":"'Table 2 LGA'!BV7","v":"2023-11-01"},{"$f":"'Table 2 LGA'!BW7","v":"2023-12-01"}]
["Albury","Stable",8.9,1.6698542692,33,546.5,592.6,722.4,720,737.7,297,328,405,408,418,24,29,31,14,13,22,28,31,27,22,25,31,27,38,36,20,33,22,12,33,23,25,30,29,34,45,31,22,22,31,23,33,30,36,48,50,39,49,34,25,23,19,30,42,35,32,41,39,35,27,32,23,37,30,35,54,34,48,32,31]
[]
[null,"start month:",{"$f":"AZ1","v":"2022-01-01"}]
[null,"end month:",{"$f":"BW1","v":"2023-12-01"}]
[null,"% change:",{"$f":"IF(ISNUMBER(B2),B2,\"Not significant\")","v":"Not significant"}]
[]
[null,"first title for Graph LGA:",{"$f":"\"NSW Recorded Crime Statistics, \"&TEXT($C$4,\"mmmm yyyy\")&\" to \"&TEXT($C$5,\"mmmm yyyy\")","v":"NSW Recorded Crime Statistics, January 2022 to December 2023"}]
[null,"second title for Graph LGA:",{"$f":"IF(A2=\"NSW\", \"Domestic violence related assault - \" & A2, \"Domestic violence related assault - \" & A2 & \" Local Government Area, NSW\")","v":"Domestic violence related assault - Albury Local Government Area, NSW"}]
[null,"axis text:","Number of reported incidents"]
[]
[null,"start month:",{"$f":"P1","v":"2019-01-01"}]
[null,"end month:",{"$f":"BW1","v":"2023-12-01"}]
[null,"% change:",{"$f":"IF(ISNUMBER(C2),C2,\"Not significant\")","v":8.9}]
[]
[null,"first title for Graph LGA:",{"$f":"\"NSW Recorded Crime Statistics, \"&TEXT($C$12,\"mmmm yyyy\")&\" to \"&TEXT($C$13,\"mmmm yyyy\")","v":"NSW Recorded Crime Statistics, January 2019 to December 2023"}]
[null,"second title for Graph LGA:",{"$f":"IF(A2=\"NSW\", \"Domestic violence related assault - \" & A2, \"Domestic violence related assault - \" & A2 & \" Local Government Area, NSW\")","v":"Domestic violence related assault - Albury Local Government Area, NSW"}]
[null,"axis text:","Number of reported incidents"]